program: Gaussian 09
title: 000256951
version: EM64L-G09RevD.01
frameworkgroup: C1[X(C8H8BrNO)]
method: RPBEPBE
basis: SDD
operation: Freq
keyword: #p
keyword: freq=noraman
keyword: PBEPBE/SDD
title: #p freq=noraman PBEPBE/SDD
converged: YES YES NO NO
title: Mulliken charges:
elementType: Br O N C C C C C C C C H H H H H H H H
charge: 0.016560 -0.262198 -0.606972 0.409728 -0.631925 -0.372334 -0.371723 -0.178302 -0.178357 0.204938 -0.219926 0.253249 0.253171 0.249034 0.248861 0.254227 0.254204 0.345143 0.332621
chargesum: 0.00000
title: Mulliken charges with hydrogens summed into heavy atoms:
elementType: Br O N C C C C C C C C
charge: 0.016560 -0.262198 0.070793 0.409728 -0.125504 -0.123300 -0.122862 0.075925 0.075846 0.204938 -0.219926
polarizability: 1.77171593e+02 2.69538884e-01 8.91190566e+01 -1.33344413e+01 2.53647258e-01 6.51300034e+01
1716.lowfreq: -11.1191 -0.0004 0.0002 0.0004 5.3674 6.6968 24.2013 39.4669 53.2718
frequency: 23.6392 38.5326 53.2590 147.8841 200.2020 249.4476 317.0802 340.8941 396.7339 406.1547 484.6484 494.3892 536.6363 564.0543 624.5435 638.5111 662.9933 714.2603 792.3736 836.8796 837.5431 859.3198 921.2337 957.9033 973.2947 996.0692 1059.6462 1061.6428 1107.3903 1180.1187 1188.5244 1213.4355 1275.4943 1297.8672 1339.1170 1369.4244 1391.0179 1453.0546 1472.3259 1576.5932 1582.5183 1595.1769 1646.1987 3013.8663 3068.6614 3132.2587 3134.3622 3168.8251 3171.8290 3514.1361 3668.1903
redmass: 5.8804 4.2007 8.2767 6.4549 4.2900 11.2349 5.0320 2.3488 7.6089 2.8800 3.2157 1.7344 2.8808 1.1703 6.4985 5.2744 1.5165 4.1438 2.2775 3.4625 1.2481 2.2294 2.0629 1.3449 1.3703 4.9812 2.4746 1.9245 1.4065 1.1361 1.1166 2.1988 1.9303 1.2723 2.9070 6.8744 2.6304 1.1207 2.3951 7.1945 1.4092 6.1968 4.0770 1.0609 1.1003 1.0899 1.0900 1.0951 1.0962 1.0445 1.1044
irintensity: 7.8094 3.7283 1.7644 1.4661 0.0639 2.6350 4.3976 0.1766 22.9253 0.0413 9.4510 2.1662 40.0643 165.3180 0.5640 6.1777 74.1004 4.6732 33.4530 7.0516 0.3457 32.8807 1.9136 0.6183 0.1451 47.0016 29.4541 1.0312 9.4196 0.0445 0.9167 3.6723 57.9573 0.0393 102.7157 0.0015 6.8957 9.2534 90.5341 0.1439 142.7965 0.2580 362.8853 12.2778 3.3775 6.8516 8.7931 7.9035 0.0792 25.6750 51.5725
temp: 298.150 k
press: 1.00000 atm
elementType: 35 8 7 6 6 6 6 6 6 6 6 1 1 1 1 1 1 1 1
symmnumber: 1
zpe: 375329.3 jmol-1
zpe.correction: 0.142955 hartree
zpe.thermalcorrener: 0.153473 hartree
zpe.thermalcorrenthalpy: 0.154417 hartree
zpe.thermalcorrgfe: 0.103772 hartree
zpe.sumelectzpe: -452.308729 hartree
zpe.sumelectthermal: -452.298211 hartree
zpe.sumelectthermalent: -452.297267 hartree
zpe.sumelectthermalfe: -452.347913 hartree
dipole: -1.9689 -0.0377 0.9689
dipole: 2.1947
quadrupole: -105.1311 -66.9067 -69.9139
quadrupole: -0.1497 2.7426 0.0096
quadrupole: -24.4806 13.7439 10.7367 -0.1497 2.7426 0.0096
hfenergy: -452.4516843 hartree
pointgroup: C01 [X(C8H8Br1N1O1)]
dipole: 0.6316244 -0.1511472 0.569011 debye
dipolederiv: -0.6215296 0.0912821 -0.265913 0.0971332 -0.081989 0.0383093 -0.2936013 0.0400283 -0.1699237 -1.2927172 0.129587 -0.3592862 0.0752656 -0.3933982 0.078396 -0.1078016 0.0639806 -0.6498152 -0.4443467 0.0050386 -0.0686125 0.0126629 -0.6268688 0.0889021 -0.1080353 0.0909691 -1.0212633 0.295866 -0.0415664 0.097105 -0.0728366 -0.0349279 -0.004633 0.2433349 -0.0131241 -0.0481302 -0.3739602 0.0094747 0.0940835 -0.036939 0.1145551 0.0270982 0.3097239 0.0133067 -0.0362955 -0.1030951 -0.0440658 0.0467112 -0.0237256 0.0655838 0.036196 0.0237718 0.0042049 -0.1177904 -0.0939275 0.0406822 0.0643817 0.0305511 0.044011 0.0313796 0.0386277 0.065692 -0.1044168 -0.2931766 0.1366795 -0.0850706 0.0835067 -0.0039835 0.0576493 -0.0973693 0.0831666 -0.1179949 -0.3102581 -0.0502643 -0.1275766 0.0043089 0.0400178 0.0245989 -0.1203153 -0.0009749 -0.1448749 1.5637417 -0.1442966 0.3051059 -0.0784237 0.2458056 -0.2500691 0.0025163 -0.231714 1.3104674 1.0210444 -0.1827212 0.5632706 -0.1845536 0.0437588 -0.0627901 0.5716313 -0.063059 0.1489177 0.0186674 -0.0022496 -0.0073184 0.0256995 -0.0407977 0.0879716 -0.0461122 0.033715 0.0806258 0.0168676 0.004673 -0.018928 -0.0063286 0.0248348 -0.111483 -0.0587565 -0.052272 0.017177 0.0491638 0.0860275 -0.044322 0.0746331 -0.046381 0.0021555 -0.0435729 0.0129499 0.1206723 0.03122 -0.0676892 -0.0811744 -0.057056 0.0013737 -0.0513161 -0.0769364 -0.062424 0.0909457 0.06568 -0.0567906 -0.0556572 -0.0562873 0.018479 -0.0527673 -0.061176 -0.0551191 0.1206357 0.0809767 0.064306 -0.0260485 0.066101 -0.0213842 -0.0021543 -0.0310579 0.0008822 0.1452348 0.2386785 0.0096827 -0.0330424 0.0331384 0.2903667 0.0257017 -0.1407216 0.0326247 0.1832184 0.1511048 0.0122103 0.0022919 0.0131499 0.3609439 0.0368547 -0.0041495 0.0371671 0.1926101 unknown
polarizability: 160.3022048|-12.9294364|90.0342307|40.1060045|-0.6526573|81.0842179 unknown
InChI: InChI=1S/C8H8BrNO/c9-7-3-1-6(2-4-7)5-8(10)11/h1-4H,5,10H2
charge 0 multiplicity 1
19 atoms
Br 3.821378 -0.614299 1.312393
O  -4.186092 0.370003 -1.011023
N  -2.787539 -0.082835 0.786289
C  -0.423372 0.10275 -0.807273
C  -1.775493 0.324754 -1.458421
C  0.295575 1.182541 -0.230248
C  0.148564 -1.195018 -0.740155
C  1.546194 0.982085 0.397268
C  1.397748 -1.417517 -0.117438
C  -3.022284 0.206221 -0.543834
C  2.082341 -0.321294 0.446944
H  -1.838637 1.329883 -1.913835
H  -1.944101 -0.393977 -2.280901
H  -0.119969 2.196113 -0.27598
H  -0.382513 -2.044817 -1.185016
H  2.091234 1.824863 0.831868
H  1.828291 -2.422171 -0.078638
H  -1.844233 -0.214458 1.148923
H  -3.588095 -0.166724 1.412278
