program: Gaussian 09
title: 000256943
version: EM64L-G09RevD.01
frameworkgroup: C1[X(C6H10ClN3O)]
method: RPBEPBE
basis: SDD
operation: Freq
keyword: #p
keyword: freq=noraman
keyword: PBEPBE/SDD
title: #p freq=noraman PBEPBE/SDD
converged: YES YES NO NO
title: Mulliken charges:
elementType: Cl O N N N C C C C C C H H H H H H H H H H
charge: -0.081096 -0.321845 -0.399241 -0.393532 -0.023111 -0.376894 -0.323236 0.323533 -0.422488 -0.553221 -0.136838 0.231458 0.267815 0.243223 0.268481 0.307280 0.301290 0.293086 0.249150 0.267398 0.278787
chargesum: 0.00000
title: Mulliken charges with hydrogens summed into heavy atoms:
elementType: Cl O N N N C C C C C C
charge: -0.081096 -0.321845 -0.091961 -0.092242 -0.023111 0.122380 0.188468 0.323533 0.119748 -0.007037 -0.136838
polarizability: 1.10123561e+02 -3.65939845e+00 9.60949111e+01 1.03158751e+00 -1.12842737e+01 7.34374998e+01
1716.lowfreq: -7.9281 -2.6346 0.0008 0.0012 0.0021 7.3488 16.9288 31.0436 63.2446
frequency: 16.3792 30.9717 63.1961 70.4589 94.8913 124.2248 157.3382 208.5112 273.7118 316.7482 346.7622 373.4776 384.5605 440.0687 490.9431 557.6112 573.3536 597.4415 670.1978 714.6164 806.7626 845.8652 848.1800 941.5433 981.5881 1003.5950 1025.2945 1058.2686 1092.6405 1153.8233 1188.0032 1199.2893 1218.6108 1242.8957 1267.8735 1295.8583 1316.8610 1364.8155 1369.3990 1438.8420 1440.8661 1447.5604 1452.1985 1467.0955 1515.5647 1623.9930 2195.1512 2989.6731 3006.1562 3029.0721 3048.5491 3065.7643 3069.1523 3099.2365 3154.6173 3546.0543 3560.5319
redmass: 6.5246 6.5420 5.3965 7.0941 4.3389 3.3656 6.0199 4.6739 2.3804 2.9869 1.6407 2.7310 2.3698 3.2316 2.8664 1.4592 2.4455 4.0252 3.9363 8.9160 2.3511 2.2659 2.6951 2.3379 2.3228 2.7354 1.6436 2.3039 3.8851 1.4848 1.7573 1.2846 1.2555 1.5035 1.4653 1.1962 1.2186 1.2687 1.2881 1.1214 1.1876 1.0871 1.0939 1.3908 2.4247 4.9918 12.3886 1.0604 1.0594 1.0609 1.0970 1.0610 1.0999 1.1059 1.1120 1.0775 1.0779
irintensity: 1.0012 1.3378 13.5228 10.3169 14.4828 8.5543 6.3602 3.7196 4.9771 11.6519 14.0463 5.0702 8.0289 6.3147 23.6422 158.5801 90.3684 37.9460 4.0137 13.3462 10.6887 7.5115 7.7171 12.6063 10.9154 3.2078 0.6977 5.7577 17.4419 3.7623 4.5171 35.9336 6.0148 150.0396 73.8837 53.4454 36.1064 4.1138 4.2840 12.7232 42.1710 20.3278 23.8767 10.5830 577.5777 162.1159 14.9432 49.5474 8.7931 33.5772 6.6089 21.6967 6.9018 6.8853 14.8382 23.3986 21.1708
temp: 298.150 k
press: 1.00000 atm
elementType: 17 8 7 7 7 6 6 6 6 6 6 1 1 1 1 1 1 1 1 1 1
symmnumber: 1
zpe: 429918.2 jmol-1
zpe.correction: 0.163747 hartree
zpe.thermalcorrener: 0.176304 hartree
zpe.thermalcorrenthalpy: 0.177248 hartree
zpe.thermalcorrgfe: 0.121647 hartree
zpe.sumelectzpe: -933.330512 hartree
zpe.sumelectthermal: -933.317956 hartree
zpe.sumelectthermalent: -933.317012 hartree
zpe.sumelectthermalfe: -933.372613 hartree
dipole: -0.2864 -2.5031 -1.2124
dipole: 2.7960
quadrupole: -70.7971 -90.0173 -67.3665
quadrupole: -5.6685 -6.1680 -0.2920
quadrupole: 5.2632 -13.9570 8.6938 -5.6685 -6.1680 -0.2920
hfenergy: -933.4942593 hartree
pointgroup: C01 [X(C6H10Cl1N3O1)]
dipole: -0.2773228 0.9736255 0.4303328 debye
dipolederiv: -0.2631099 -0.0889371 0.020065 -0.1539307 -0.4453 0.1118117 0.079702 0.2044312 -0.3407352 -0.8086119 -0.0403392 -0.0048901 -0.0578086 -0.7042785 0.2933309 0.0197909 0.3234016 -0.7037168 -1.4107576 0.0627162 -0.0519377 0.0945723 -0.3533143 -0.0769982 -0.3585609 -0.125509 -0.6334258 -1.4162584 -0.2954697 0.0921753 -0.4561568 -0.6053326 -0.0799467 0.1246882 -0.0727044 -0.4118395 -0.2651199 0.0167193 0.007974 0.1026359 -0.3134262 -0.0480637 -0.0334212 0.0326285 -0.2248631 0.7805468 -0.0235535 -0.1519717 0.1937322 0.2021754 0.1009104 -0.3046096 0.1619081 0.3656783 0.6376553 0.0020532 0.0489649 -0.2251291 0.0243702 0.1395971 0.3401244 0.2538051 0.0981388 2.2955283 0.254205 0.088943 0.2982496 0.8171301 -0.4766287 0.1350691 -0.5126588 0.8427529 0.0310619 0.0854248 0.0348423 0.1178859 -0.0363203 -0.064575 0.1283437 -0.0328126 0.0180405 0.1810713 0.1128332 -0.0851215 0.1903123 0.5052703 -0.3039637 -0.1610446 -0.3021589 0.4009041 -0.0301207 -0.0604185 0.0196589 -0.1873127 0.2295423 0.0055813 0.0757424 -0.0798534 -0.1033134 -0.0729331 -0.0215759 -0.0682645 0.0285939 0.1132932 0.0255899 -0.0713914 -0.0212345 -0.0747501 0.0634814 0.0647394 0.0221857 -0.0190541 -0.0764105 -0.007842 0.0927604 0.015469 0.0778533 -0.1570271 0.0410216 0.0453977 0.0668656 0.0648418 -0.061543 0.0526653 -0.1224297 0.0054449 0.1821668 -0.0457856 0.0365641 0.0395568 0.0657061 0.0687156 -0.0797364 -0.0066426 0.0570023 0.103128 -0.0367414 -0.0223436 -0.0496792 0.1732321 0.1413449 -0.0086224 0.1116434 0.2721263 0.1507801 -0.0034434 -0.0264139 0.0687685 0.2672306 0.1313311 -0.0483943 0.1158846 0.2095799 0.1323618 0.007176 -0.1004311 -0.013544 0.0553816 -0.0099082 -0.0746316 -0.0153021 0.0505086 -0.075649 -0.0614901 0.0614758 -0.0248499 0.0150368 0.0160339 0.0695519 0.0031903 0.1167322 -0.1018059 -0.0168609 -0.0733125 -0.0234403 0.0228783 0.082328 -0.0635566 0.0604057 0.0103081 0.0436118 0.0477267 0.1064399 0.0097326 -0.0217064 0.0128943 0.0855305 0.0085386 -0.0324263 unknown
polarizability: 108.0297664|5.201325|96.367679|-1.713166|-13.3621517|75.2585269 unknown
InChI: InChI=1S/C6H10ClN3O/c7-2-5-10-6(11)9-4-1-3-8/h9-10H,1-2,4-5H2
charge 0 multiplicity 1
21 atoms
Cl -3.75939 -2.023053 0.80325
O  -0.352775 1.780664 -0.711042
N  0.808754 0.600665 0.934187
N  -1.509185 0.270362 0.659521
N  3.272883 -1.982721 -0.365496
C  2.077377 1.223971 0.556233
C  -2.796196 0.499979 0.003089
C  -0.356902 0.929627 0.237198
C  2.712226 0.597348 -0.724985
C  -3.395196 -0.774771 -0.588331
C  3.030968 -0.827557 -0.545897
H  2.778146 1.147555 1.405114
H  1.892318 2.290066 0.342891
H  -3.519454 0.960481 0.703518
H  -2.607263 1.223829 -0.812971
H  0.821873 -0.179012 1.592543
H  -1.488803 -0.39437 1.435104
H  1.998288 0.720193 -1.559709
H  3.635159 1.14767 -0.989482
H  -4.367576 -0.592253 -1.069155
H  -2.701551 -1.294075 -1.26478
