program: Gaussian 09
title: 000256915
version: EM64L-G09RevD.01
frameworkgroup: C1[X(C12H11N3O2)]
method: RPBEPBE
basis: SDD
operation: Freq
keyword: #p
keyword: freq=noraman
keyword: PBEPBE/SDD
title: #p freq=noraman PBEPBE/SDD
converged: YES YES NO NO
title: Mulliken charges:
elementType: O O N N N C C C C C C C C C C C C H H H H H H H H H H H
charge: -0.305740 -0.285585 -0.070235 -0.315555 -0.299102 0.410681 -0.062055 0.019043 -0.306433 -0.279633 -0.384822 -0.320189 -0.242309 -0.218177 0.179696 0.268597 -0.758446 0.248851 0.279625 0.238675 0.268262 0.234516 0.237348 0.382945 0.346949 0.257041 0.219041 0.257010
chargesum: 0.00000
title: Mulliken charges with hydrogens summed into heavy atoms:
elementType: O O N N N C C C C C C C C C C C C
charge: -0.305740 -0.285585 -0.070235 0.067391 0.047848 0.410681 -0.062055 0.019043 -0.057582 -0.000008 -0.146147 -0.051928 -0.007793 0.019171 0.179696 0.268597 -0.025353
polarizability: 2.73940074e+02 9.57544439e+00 1.85619071e+02 -1.87789388e-02 1.11252957e-02 6.60647614e+01
1716.lowfreq: -3.9970 -0.0008 0.0003 0.0007 4.9657 9.0388 41.9778 53.6912 56.1242
frequency: 41.9525 53.6801 56.0884 88.3619 105.0186 112.9704 159.1986 183.1144 235.7991 243.6647 278.4341 316.2431 338.5893 400.7086 410.0280 481.7990 493.2343 504.3826 518.7942 561.8272 590.3993 615.7255 621.9704 623.7542 642.9387 726.0561 740.7844 755.5342 775.2297 788.0572 803.0764 861.3171 880.2933 892.8147 933.9071 970.3701 975.4003 991.0864 1000.0088 1003.0467 1017.1696 1042.6788 1080.6068 1110.9617 1141.5702 1169.4318 1181.3229 1226.4908 1245.9535 1262.7688 1276.0210 1301.5951 1361.8448 1394.8704 1404.2114 1415.7600 1429.0697 1449.9163 1460.3315 1471.8558 1507.5424 1523.9055 1548.2598 1565.4601 1588.5131 1617.1585 1624.3109 2999.3575 3098.2830 3103.9680 3125.6808 3136.5942 3141.3371 3157.7325 3172.3848 3179.4600 3474.9325 3504.7940
redmass: 4.9116 5.8658 4.5664 1.5043 6.4732 2.3029 5.5905 4.2206 4.7718 6.0325 7.3169 5.7318 6.9673 3.4818 3.6318 3.0352 4.3994 3.9097 7.0216 2.3105 7.9706 2.2116 7.4941 4.7679 2.0503 2.0242 1.1922 5.7070 1.5755 6.8273 3.2868 1.4963 6.4898 1.6872 5.0622 1.3634 1.7450 3.7815 1.3332 1.3548 2.1991 1.5841 2.9522 1.6840 1.2320 1.1049 2.0714 1.8192 1.8974 1.9604 2.8324 2.7454 3.7495 1.2316 3.4069 3.3861 2.5506 1.0447 2.7315 1.2256 3.8698 2.4379 7.8142 8.7189 6.4189 8.5111 6.5190 1.0358 1.0981 1.1009 1.0874 1.0907 1.0893 1.0948 1.1000 1.0961 1.0800 1.0789
irintensity: 0.3915 2.2223 6.4052 0.0125 11.0862 0.4017 27.9845 6.2184 0.9594 1.0957 0.1650 0.0447 12.1469 1.5360 33.2391 10.2319 5.4850 1.9500 1.8567 38.0519 1.5991 23.1759 3.1593 1.5227 47.4719 25.1132 81.2476 4.3423 86.4504 4.6941 0.3291 53.3610 4.9891 9.7545 2.0838 5.1368 7.9148 1.3152 0.2598 0.0036 6.2575 16.9361 0.7117 18.6839 0.3737 2.1188 12.7030 8.6883 13.9247 46.2452 55.4741 2.6914 4.5430 70.0098 113.0955 352.1182 112.5496 16.4045 70.2757 57.4832 10.8605 55.6474 113.5176 273.9671 45.6052 13.9017 3.2624 12.0793 7.3673 17.6665 3.1794 9.1145 11.3727 20.8326 20.7306 2.8666 39.4135 91.5716
temp: 298.150 k
press: 1.00000 atm
elementType: 8 8 7 7 7 6 6 6 6 6 6 6 6 6 6 6 6 1 1 1 1 1 1 1 1 1 1 1
symmnumber: 1
zpe: 557996.7 jmol-1
zpe.correction: 0.212530 hartree
zpe.thermalcorrener: 0.227210 hartree
zpe.thermalcorrenthalpy: 0.228154 hartree
zpe.thermalcorrgfe: 0.169621 hartree
zpe.sumelectzpe: -777.398454 hartree
zpe.sumelectthermal: -777.383774 hartree
zpe.sumelectthermalent: -777.382830 hartree
zpe.sumelectthermalfe: -777.441363 hartree
dipole: -2.4188 0.8956 0.0051
dipole: 2.5793
quadrupole: -65.4893 -103.6391 -102.0567
quadrupole: 4.1998 0.0109 -0.0099
quadrupole: 24.9057 -13.2441 -11.6617 4.1998 0.0109 -0.0099
hfenergy: -777.6109837 hartree
pointgroup: C01 [X(C12H11N3O2)]
dipole: 0.9500414 0.3564665 0.0107585 debye
polarizability: 273.9701784|-9.1815324|185.5340921|3.258308|-0.8176945|66.1196361 unknown
InChI: InChI=1S/C12H11N3O2/c1-8(16)14-15-12(17)11-7-6-9-4-2-3-5-10(9)13-11/h2-7,14-15H,1H3
charge 0 multiplicity 1
28 atoms
O  -1.973687 2.414631 -0.074003
O  -3.761464 -2.099056 -0.074769
N  0.468505 -0.264219 -0.019556
N  -2.171679 0.105193 -0.062982
N  -3.561277 0.198192 -0.086261
C  2.805083 0.563634 0.011122
C  1.82983 -0.512203 0.002567
C  0.054527 1.022242 -0.033519
C  2.313345 1.910816 -0.003879
C  0.939342 2.146758 -0.026229
C  4.19918 0.237934 0.03363
C  2.280629 -1.871163 0.016874
C  4.612538 -1.096467 0.047028
C  3.647587 -2.156003 0.038606
C  -1.427685 1.257829 -0.058239
C  -4.322542 -0.95832 -0.091203
C  -5.82544 -0.743929 -0.117185
H  3.025223 2.744146 0.002259
H  0.506144 3.150245 -0.038684
H  4.936716 1.04936 0.040109
H  1.524384 -2.662002 0.010039
H  5.680162 -1.340756 0.064146
H  3.990335 -3.196214 0.049355
H  -1.759734 -0.836681 -0.050906
H  -3.904735 1.164472 -0.0978
H  -6.275261 -1.229306 0.765976
H  -6.113742 0.321129 -0.125044
H  -6.245582 -1.23446 -1.012053
