program: Gaussian 09
title: 000256913
version: EM64L-G09RevD.01
frameworkgroup: C1[X(C12H10N2O4)]
method: RPBEPBE
basis: SDD
operation: Freq
keyword: #p
keyword: freq=noraman
keyword: PBEPBE/SDD
title: #p freq=noraman PBEPBE/SDD
converged: YES YES NO NO
title: Mulliken charges:
elementType: O O O O N N C C C C C C C C C C C C H H H H H H H H H H
charge: -0.246494 -0.219000 -0.160296 -0.231571 -0.426740 0.061564 0.469707 0.205796 -0.226698 0.154735 -0.179189 0.023183 -0.288687 -0.168688 -0.345674 0.230371 -0.508747 -0.772512 0.296699 0.340766 0.242272 0.257175 0.258968 0.223371 0.257131 0.268770 0.253252 0.230536
chargesum: 0.00000
title: Mulliken charges with hydrogens summed into heavy atoms:
elementType: O O O O N N C C C C C C C C C C C C
charge: -0.246494 -0.219000 -0.160296 -0.231571 -0.085974 0.061564 0.469707 0.205796 -0.226698 0.154735 -0.179189 0.023183 0.008012 0.073584 -0.088499 0.230371 0.243812 -0.033043
polarizability: 2.43592902e+02 -1.53710861e-01 1.98384248e+02 4.41971638e+00 3.27033868e+00 7.62099788e+01
1716.lowfreq: -7.0939 -4.7947 -0.0010 -0.0008 -0.0008 5.7842 40.7990 49.9396 57.2861
frequency: 40.7943 49.8926 57.2555 67.0594 83.5462 96.8009 118.6103 122.3235 181.5621 188.9125 224.9036 261.4580 269.1474 306.8933 332.8837 347.3705 376.0668 400.1085 417.5443 442.7815 453.1474 490.2392 546.3885 572.1276 596.5031 630.9653 675.7622 693.6388 715.3645 729.3784 740.9837 820.4679 830.4023 863.5699 884.7079 935.4355 963.4180 969.9529 993.8201 1007.4604 1036.3613 1054.2499 1071.3735 1099.7582 1104.9394 1148.7450 1175.8829 1198.7377 1239.3939 1265.0248 1290.0515 1314.8932 1341.6974 1384.9585 1410.9196 1420.1094 1432.7367 1445.3886 1459.2307 1464.8497 1469.1488 1478.4584 1520.2891 1550.1371 1558.6698 1579.3874 1599.7796 1637.0204 2993.6518 3016.3929 3081.3354 3126.7905 3134.2917 3139.3288 3155.8818 3158.8033 3177.0307 3445.7938
redmass: 4.5145 3.2178 1.2051 2.1443 1.9767 4.9088 3.2191 6.5504 4.6849 4.0674 6.1238 5.6392 5.6222 5.1773 6.3640 7.7301 8.8694 6.0704 4.8153 5.4821 6.1951 6.5366 4.4966 6.1795 3.7333 7.6373 4.6855 1.4860 3.6417 6.1874 6.1569 4.1229 2.0037 5.8329 7.4115 4.3392 1.4495 4.1861 2.4116 1.4025 1.6985 2.2083 3.6317 1.2446 3.3656 1.3722 1.6766 3.7361 2.4308 2.6441 4.4582 6.1061 4.5815 1.2242 2.8128 1.2419 2.2446 1.1734 1.0700 1.2377 1.0995 1.4674 8.2147 7.1446 8.1338 7.4346 7.0997 6.0116 1.0377 1.0282 1.0981 1.0991 1.1045 1.0894 1.1068 1.0912 1.1000 1.0753
irintensity: 2.3469 4.7719 0.1868 6.8811 3.9214 0.3656 4.8899 12.3984 1.2896 3.2540 7.7778 4.0537 5.9073 4.1482 2.6197 0.7345 25.5481 2.3332 1.0760 3.5710 6.4533 8.7390 7.6204 8.9019 14.2551 3.7770 6.9782 77.8848 45.9383 9.5054 4.6357 20.4060 33.7467 14.7094 6.5807 34.1248 0.4837 15.0925 79.1105 1.3529 21.2785 27.2805 35.9524 23.5439 4.8476 3.2734 65.3445 71.5888 174.0165 145.3898 90.0627 61.3413 193.0208 69.8253 5.7639 72.1437 50.0212 107.5301 50.1359 148.9561 17.7162 325.6075 71.4082 189.4742 9.5134 47.1699 193.4449 99.6776 7.0894 49.7433 13.1802 9.3724 20.6169 10.5866 5.1388 6.5472 17.9502 46.0753
temp: 298.150 k
press: 1.00000 atm
elementType: 8 8 8 8 7 7 6 6 6 6 6 6 6 6 6 6 6 6 1 1 1 1 1 1 1 1 1 1
symmnumber: 1
zpe: 530431.0 jmol-1
zpe.correction: 0.202031 hartree
zpe.thermalcorrener: 0.218564 hartree
zpe.thermalcorrenthalpy: 0.219508 hartree
zpe.thermalcorrgfe: 0.156797 hartree
zpe.sumelectzpe: -872.376334 hartree
zpe.sumelectthermal: -872.359801 hartree
zpe.sumelectthermalent: -872.358857 hartree
zpe.sumelectthermalfe: -872.421568 hartree
dipole: 0.3026 -3.4420 -0.4785
dipole: 3.4883
quadrupole: -82.0955 -106.8908 -106.0885
quadrupole: -5.7341 5.5598 0.6243
quadrupole: 16.2628 -8.5326 -7.7303 -5.7341 5.5598 0.6243
hfenergy: -872.5783648 hartree
pointgroup: C01 [X(C12H10N2O4)]
dipole: 0.1406077 -1.3544196 0.1710275 debye
polarizability: 243.492193|2.0004886|191.8150777|5.5959037|-27.7588088|82.8798587 unknown
InChI: InChI=1S/C12H10N2O4/c1-6(15)14-9-10(16)7-4-3-5-13-8(7)11(17)12(9)18-2/h3-5,14H,1-2H3
charge 0 multiplicity 1
28 atoms
O  -1.833825 1.30838 -1.295258
O  0.106037 -2.75286 0.175642
O  0.750266 2.536538 -1.134483
O  -3.444291 0.41232 0.708616
N  -2.124598 -1.304653 -0.199992
N  3.003128 1.129103 -0.272731
C  1.626296 -0.884693 -0.048077
C  -0.895603 -0.638639 -0.316924
C  1.792103 0.501756 -0.321561
C  -0.746209 0.685093 -0.737474
C  0.275669 -1.506372 -0.055301
C  0.601703 1.34214 -0.742639
C  2.76923 -1.65857 0.262432
C  4.025789 -1.021916 0.305922
C  4.09128 0.369273 0.042256
C  -3.337237 -0.767789 0.281542
C  -2.178559 2.720259 -0.960403
C  -4.506188 -1.744271 0.225811
H  2.646195 -2.726046 0.468445
H  -2.03131 -2.329347 -0.222499
H  4.93697 -1.578596 0.543769
H  5.047388 0.903057 0.081246
H  -5.217896 -1.499797 1.028751
H  -4.193082 -2.799088 0.319789
H  -5.02972 -1.630165 -0.741459
H  -1.351918 3.393263 -1.227449
H  -2.422627 2.767074 0.113363
H  -3.077792 2.922747 -1.559234
