program: Gaussian 09
title: 000256910
version: EM64L-G09RevD.01
frameworkgroup: C1[X(C18H12O4)]
method: RPBEPBE
basis: SDD
operation: Freq
keyword: #pfreq=noraman
keyword: PBEPBE/SDD
title: #p freq=noraman PBEPBE/SDD
converged: YES YES NO NO
title: Mulliken charges:
elementType: O O O O C C C C C C C C C C C C C C C C C C H H H H H H H H H H H H
charge: -0.367534 -0.176834 -0.437984 -0.227137 0.216618 0.235037 0.430046 0.001953 -0.348680 0.017850 -0.497538 0.250754 -0.352327 -0.426571 0.112354 -0.272993 -0.239128 -0.366457 -0.335294 -0.227481 -0.223468 0.073105 0.250654 0.239938 0.192897 0.244368 0.232881 0.271540 0.232515 0.279693 0.238042 0.237136 0.356623 0.385423
chargesum: 0.00000
title: Mulliken charges with hydrogens summed into heavy atoms:
elementType: O O O O C C C C C C C C C C C C C C C C C C
charge: -0.010912 -0.176834 -0.052561 -0.227137 0.216618 0.235037 0.430046 0.001953 -0.098026 0.017850 -0.257600 0.250754 -0.159430 -0.182203 0.112354 -0.040112 -0.006613 -0.094918 -0.055600 0.010561 0.013669 0.073105
polarizability: 3.27975938e+02 -1.13519239e+01 1.79391400e+02 3.59926744e+01 1.34790787e+01 1.51384857e+02
1716.lowfreq: -8.6077 -4.0802 -0.0007 -0.0005 0.0002 2.4857 19.7021 31.6859 47.4426
frequency: 19.6088 31.6378 47.4363 60.3132 93.6634 105.3138 124.9564 134.8003 174.8853 207.3705 233.8806 237.3131 278.3631 290.2066 317.3634 330.8674 379.2118 389.2675 409.0966 422.7617 469.5800 475.5786 498.5358 517.8447 552.6115 566.7060 579.3139 590.1708 599.0777 600.3842 652.8727 666.4010 687.5401 703.6237 721.3536 747.5316 760.1564 785.4740 791.1185 792.7278 811.6633 826.1934 864.0073 872.9724 902.1753 948.3005 962.3487 969.0177 977.6277 990.8630 998.5362 1005.2128 1031.8150 1044.0939 1079.8023 1102.4331 1138.7785 1160.7394 1163.0686 1171.1136 1178.4856 1183.8070 1237.0881 1246.7934 1266.7282 1272.7398 1286.2798 1315.7760 1348.2132 1379.0437 1410.9310 1424.0853 1426.7461 1432.3409 1464.0712 1472.3697 1511.5533 1554.3980 1572.7020 1584.7597 1600.6944 1604.2009 1633.7024 1638.6516 3095.1529 3126.8706 3132.3008 3136.4173 3144.8437 3151.9822 3155.6950 3165.0089 3165.4264 3180.4762 3528.6504 3563.2743
redmass: 6.8389 5.2299 6.3157 9.2429 5.5776 4.7161 4.8209 5.8890 6.8140 5.2900 5.6854 5.0202 2.0778 5.3100 3.1080 4.1186 7.6314 5.9228 3.2665 2.6589 5.5362 4.7706 4.6637 5.1663 6.6099 3.3390 4.4276 1.3340 4.5009 5.9299 5.0311 5.4608 3.9383 5.5691 2.4975 1.6964 3.6165 2.5357 3.6989 2.0344 2.2682 2.4327 4.7676 1.7417 1.4676 1.3719 3.7944 1.4379 1.4407 1.3590 4.9348 1.3711 2.3723 2.3212 3.3046 2.1014 1.6149 1.6389 1.5847 1.5003 1.0709 1.2246 2.1431 2.2851 1.7405 1.5687 2.1186 2.5721 3.6683 10.9254 2.4108 2.5995 3.5687 3.5143 2.6567 2.6192 3.5588 10.3651 6.8924 7.9148 6.1244 6.0391 6.7384 8.7402 1.0881 1.0873 1.0867 1.0863 1.0933 1.0910 1.0971 1.1000 1.0967 1.0974 1.0642 1.0653
irintensity: 1.2953 0.7408 2.9256 0.2965 6.0971 0.7873 0.8730 1.4448 0.3887 0.6161 3.2687 2.0304 48.6269 23.7602 29.0631 11.0625 13.3650 5.0574 7.6200 25.3425 2.4909 24.7994 11.9942 5.5963 3.4887 7.3183 46.0035 75.0093 23.9687 11.1106 5.3321 5.6715 46.1721 2.3490 64.6194 70.1064 29.4706 29.1165 7.4029 17.8940 42.1855 17.6953 9.0331 16.2263 1.0663 4.2082 65.9637 3.3391 9.4656 0.3795 225.5164 4.9308 15.7111 5.4806 75.5039 64.1224 73.6885 38.1042 45.7414 15.1549 0.0419 5.2996 8.9668 193.3588 29.9112 6.7547 98.3258 69.1823 85.0298 9.6306 0.1096 1.5012 11.9899 3.9297 31.5278 4.9079 19.6931 213.3424 14.5209 52.1870 26.6029 11.2358 18.7826 265.9425 13.9453 0.7377 2.3273 2.6630 21.8884 10.5544 15.1024 36.0237 11.7316 12.0236 42.3619 23.9964
temp: 298.150 k
press: 1.00000 atm
elementType: 8 8 8 8 6 6 6 6 6 6 6 6 6 6 6 6 6 6 6 6 6 6 1 1 1 1 1 1 1 1 1 1 1 1
symmnumber: 1
zpe: 655912.1 jmol-1
zpe.correction: 0.249824 hartree
zpe.thermalcorrener: 0.267945 hartree
zpe.thermalcorrenthalpy: 0.268890 hartree
zpe.thermalcorrgfe: 0.202259 hartree
zpe.sumelectzpe: -992.514656 hartree
zpe.sumelectthermal: -992.496535 hartree
zpe.sumelectthermalent: -992.495591 hartree
zpe.sumelectthermalfe: -992.562221 hartree
dipole: 1.1503 -3.9455 -1.3450
dipole: 4.3242
quadrupole: -93.9532 -128.6110 -119.1414
quadrupole: 4.3843 10.4526 -2.3414
quadrupole: 19.9487 -14.7092 -5.2395 4.3843 10.4526 -2.3414
hfenergy: -992.7644801 hartree
pointgroup: C01 [X(C18H12O4)]
dipole: 0.4437085 -1.0114035 1.2940396 debye
polarizability: 320.8652925|40.0433017|167.7169033|32.6283268|-15.8341774|170.1699996 unknown
InChI: InChI=1S/C18H12O4/c19-16-12-6-2-1-5-11(12)9-10-15(16)17(20)13-7-3-4-8-14(13)18(21)22/h1-10,19,21H
charge 0 multiplicity 1
34 atoms
O  1.429222 2.033108 -1.37601
O  -0.986366 1.149181 -2.445422
O  -2.372258 0.562666 2.778704
O  -1.052669 1.6237 1.194207
C  2.741916 0.298908 -0.206395
C  0.339535 -0.021723 -0.773462
C  2.757239 -0.997889 0.436552
C  1.507489 0.773339 -0.793621
C  0.394879 -1.304033 -0.129168
C  -0.936997 0.419625 -1.413923
C  1.560104 -1.78491 0.458776
C  -2.246249 -0.15142 -0.878222
C  3.956426 1.061842 -0.242881
C  3.975406 -1.464598 1.03016
C  -2.700574 -0.040341 0.471265
C  5.129427 0.581108 0.344665
C  5.138871 -0.693625 0.99182
C  -3.062644 -0.829496 -1.816648
C  -3.929977 -0.638125 0.856132
C  -4.283916 -1.421303 -1.428668
C  -4.714808 -1.334759 -0.084322
C  -1.948766 0.786758 1.45525
H  -0.511488 -1.918318 -0.118254
H  1.576374 -2.769473 0.938445
H  4.000709 2.033185 -0.754149
H  3.977198 -2.447036 1.516651
H  6.047455 1.176419 0.301728
H  -2.724596 -0.882229 -2.856479
H  6.062962 -1.062882 1.449273
H  -4.261746 -0.531767 1.892378
H  -4.895194 -1.945904 -2.170952
H  -5.661365 -1.791296 0.223484
H  2.223046 2.582009 -1.155795
H  -1.856643 1.166377 3.378083
