program: Gaussian 09
title: 000023203
version: EM64L-G09RevD.01
frameworkgroup: C1[X(C9H14O)]
method: RPBEPBE
basis: SDD
operation: Freq
keyword: #pfreq=noraman
keyword: PBEPBE/SDD
title: #p freq=noraman PBEPBE/SDD
converged: YES YES NO NO
title: Mulliken charges:
elementType: O C C C C C C C C C H H H H H H H H H H H H H H
charge: -0.216706 -0.348130 -0.343572 -0.461482 -0.691224 -0.139530 -0.235098 -0.157645 -0.249092 -0.119866 0.194175 0.210203 0.194612 0.199033 0.207001 0.212471 0.212786 0.210676 0.219639 0.225952 0.241193 0.221827 0.257883 0.154895
chargesum: 0.00000
title: Mulliken charges with hydrogens summed into heavy atoms:
elementType: O C C C C C C C C C
charge: -0.216706 0.056248 0.050074 -0.042010 -0.048123 0.086422 0.006094 0.064183 0.008790 0.035029
polarizability: 2.21331718e+02 1.26781176e+01 6.82738949e+01 -1.59080416e+01 4.78106552e+00 8.26187766e+01
1716.lowfreq: -15.1801 0.0001 0.0002 0.0003 2.9102 13.2673 30.2642 59.8475 76.4820
frequency: 27.6141 59.7150 76.4419 97.3263 111.4461 133.6751 201.6135 224.0229 233.5344 269.2988 276.6598 346.9694 419.1621 457.6880 499.6436 602.3736 728.9076 779.3502 816.5156 883.8028 893.4623 923.9789 946.4762 972.1897 999.1098 1015.5585 1032.7985 1067.5140 1100.9249 1115.3256 1144.3848 1184.7838 1197.8598 1224.5906 1247.5498 1265.3502 1276.9449 1287.7944 1300.1904 1303.9748 1331.0405 1347.1038 1382.2838 1389.1531 1456.0681 1467.1475 1476.3879 1476.7107 1487.4803 1578.0410 1621.0434 1650.3556 2853.0146 2952.9373 2964.9139 2974.1196 2975.1415 3005.5779 3021.3691 3045.0067 3070.8413 3071.9387 3073.8094 3074.7893 3101.7836 3130.9170
redmass: 4.2487 2.3514 1.9808 3.5142 2.9566 2.6271 2.9958 1.3439 2.1788 3.1536 3.2349 2.4927 3.1313 3.8073 2.9352 3.6899 1.0793 1.2052 1.4317 1.7361 1.6839 1.4186 1.2014 1.6682 3.6196 1.1306 1.6969 2.6031 2.0027 2.1944 3.3079 1.9757 1.4774 1.3655 1.3046 1.2102 1.5693 1.0971 1.3087 1.2648 1.3818 1.5514 1.2880 1.2117 1.0943 1.0704 1.0461 1.0627 1.0838 7.4136 5.0822 5.8548 1.0843 1.0621 1.0588 1.0581 1.0388 1.0971 1.0981 1.1029 1.0921 1.0978 1.0931 1.0993 1.0899 1.0919
irintensity: 1.6071 1.5022 0.0951 3.7242 1.4846 2.9475 4.6804 0.3112 0.0188 0.4131 3.3661 2.5365 0.9251 4.1876 5.6954 11.8678 11.5545 2.0732 6.4859 2.2177 2.3169 12.8358 0.0655 6.5987 1.1929 101.1067 23.5235 5.1615 9.0838 74.3945 69.6904 39.4331 2.0185 3.6038 2.3240 4.1877 0.6017 0.6572 1.3752 1.6858 7.2329 0.0357 15.7521 11.4963 6.5747 1.5846 11.0218 6.7546 18.3141 183.1177 327.8726 99.4540 123.9039 17.0714 4.9171 49.8411 62.7165 4.6792 3.5551 37.3325 8.7916 38.7084 70.2801 50.9374 28.9775 10.8986
temp: 298.150 k
press: 1.00000 atm
elementType: 8 6 6 6 6 6 6 6 6 6 1 1 1 1 1 1 1 1 1 1 1 1 1 1
symmnumber: 1
zpe: 536677.7 jmol-1
zpe.correction: 0.204410 hartree
zpe.thermalcorrener: 0.216548 hartree
zpe.thermalcorrenthalpy: 0.217492 hartree
zpe.thermalcorrgfe: 0.164811 hartree
zpe.sumelectzpe: -425.758054 hartree
zpe.sumelectthermal: -425.745915 hartree
zpe.sumelectthermalent: -425.744971 hartree
zpe.sumelectthermalfe: -425.797652 hartree
dipole: -6.0879 -0.5679 1.2708
dipole: 6.2450
quadrupole: -95.2841 -63.3985 -57.9702
quadrupole: -1.1679 5.5098 2.2604
quadrupole: -23.0665 8.8191 14.2474 -1.1679 5.5098 2.2604
hfenergy: -425.9624633 hartree
pointgroup: C01 [X(C9H14O1)]
dipole: -2.4024716 0.3684536 -0.3591939 debye
dipolederiv: -1.4290334 0.1641387 -0.0710427 0.2041508 -0.3822773 0.0180745 -0.2439853 0.0442501 -0.4628036 0.0293815 -0.0141953 0.0278122 0.1992292 0.1014103 -0.0382707 0.2932433 -0.059297 0.1462685 0.0740198 -0.0333844 0.0070583 -0.1658375 0.1168954 -0.041604 -0.1139102 -0.0413349 0.1391202 -0.4319246 -0.0256904 0.0239311 -0.0758356 0.1098222 -0.0427512 -0.1407723 -0.0049422 0.1023754 -0.1100223 -0.0640546 -0.0156075 -0.005968 0.0397139 -0.0242618 0.0492904 -0.021981 0.0803893 0.7377183 -0.11847 -0.0265623 -0.2534878 -0.1899908 -0.0196964 0.0582472 -0.0582132 0.1588846 -0.8162131 0.0480567 0.029996 0.1381743 -0.1706581 -0.0146525 -0.1360374 0.0180189 0.1000608 1.0318251 -0.161447 0.0023172 -0.1821169 -0.0603674 -0.0111545 -0.021916 -0.0201997 0.1206082 -1.3147184 0.1526988 0.0396845 0.1785195 -0.2073314 -0.0171757 0.3315485 -0.0540154 0.0359925 1.9071687 -0.2814878 0.0794009 -0.3016783 0.1441452 -0.043568 -0.4479338 0.0290632 0.6874996 0.0569665 -0.0136842 -0.0022999 -0.0003438 0.0612976 0.0117757 -0.0076581 -0.0147553 -0.1897709 0.0307703 0.0570717 -0.0082591 0.034389 -0.1460844 0.028999 -0.0204851 0.0521285 0.0566978 0.0111713 0.0337413 -0.0034133 0.0715325 -0.1889323 0.034651 -0.011281 0.0640999 0.0626685 0.033249 -0.0165523 -0.0459638 -0.006334 0.0677065 -0.0050563 0.0065015 -0.0233234 -0.1980929 -0.0317757 0.1080286 -0.0167448 0.0829941 -0.1068716 0.0332605 0.0755046 0.0494096 0.0759756 0.0284527 -0.0081355 -0.0324282 -0.0273361 0.0727782 0.0230622 0.0276965 -0.0223539 -0.1560197 0.0779676 0.0896655 -0.0337302 0.0207793 -0.153305 0.0453219 -0.0346237 0.0618535 0.0696377 0.0967652 -0.0154901 0.002612 -0.0188763 0.0720194 0.0203089 -0.0631775 -0.0142964 -0.1836917 -0.2236343 0.0040005 0.0783473 0.0090061 0.0767585 -0.0281398 0.0969057 -0.0212673 0.0581625 0.0420807 0.0148722 0.0281508 0.0349289 0.146326 0.0006737 0.0606976 0.009376 -0.1243531 0.0422193 0.0217434 0.0100601 0.0163534 0.1577471 0.0116015 0.0633074 0.0041243 -0.0976071 0.0568091 0.0187421 0.000369 0.018416 0.1547018 0.0128576 0.0463044 0.008314 -0.1110861 0.0545672 0.0216089 0.0248337 0.0211306 0.1756111 0.0082218 0.050051 0.0049752 -0.0810574 0.0461896 0.0182233 -0.0985215 0.0082106 0.1088852 0.0375226 0.0824822 0.0103667 -0.2898588 unknown
polarizability: 221.8954361|-15.7940221|66.5673856|8.9251666|-1.6145095|83.7615675 unknown
InChI: InChI=1S/C9H14O/c1-2-3-4-5-6-7-8-9-10/h5-9H,2-4H2,1H3
charge 0 multiplicity 1
24 atoms
O  5.470937 -0.465408 0.152792
C  -2.943253 -0.215729 -0.242327
C  -4.349523 0.028098 0.351013
C  -1.897716 0.821845 0.259031
C  -5.389993 -1.000889 -0.140527
C  -0.538956 0.626785 -0.361244
C  0.620628 0.382283 0.328617
C  1.908312 0.186775 -0.314766
C  3.092604 -0.055114 0.345347
C  4.348715 -0.240141 -0.387193
H  -2.999167 -0.176278 -1.349702
H  -2.599299 -1.235968 0.019554
H  -4.684468 1.051922 0.086326
H  -4.289074 -0.003795 1.457802
H  -2.276101 1.835533 0.005222
H  -1.825213 0.774359 1.362735
H  -5.095572 -2.029396 0.1407
H  -5.489514 -0.969899 -1.241919
H  -6.387144 -0.804691 0.294046
H  -0.495612 0.674104 -1.462167
H  0.591129 0.32884 1.426573
H  1.926617 0.238961 -1.416012
H  3.136563 -0.117259 1.440364
H  4.255802 -0.167637 -1.502868
