program: Gaussian 09
title: 000256875
version: EM64L-G09RevD.01
frameworkgroup: C1[X(C14H18Cl2N2O3)]
method: RPBEPBE
basis: SDD
operation: Freq
keyword: #p
keyword: freq=noraman
keyword: PBEPBE/SDD
title: #p freq=noraman PBEPBE/SDD
converged: YES YES NO NO
title: Mulliken charges:
elementType: Cl Cl O O O N N C C C C C C C C C C C C C C H H H H H H H H H H H H H H H H H H
charge: -0.053373 -0.050142 -0.295353 -0.303787 -0.224780 -0.181541 -0.428701 0.461268 -0.370684 -0.369387 -0.384606 -0.363615 -0.589481 -0.588941 0.294506 -0.366035 -0.399451 0.181073 -0.402058 0.233568 -0.494511 0.242629 0.249690 0.252726 0.240379 0.233919 0.237119 0.265238 0.294135 0.296018 0.262903 0.201959 0.277699 0.357523 0.276969 0.275572 0.249423 0.248988 0.233140
chargesum: 0.00000
title: Mulliken charges with hydrogens summed into heavy atoms:
elementType: Cl Cl O O O N N C C C C C C C C C C C C C C
charge: -0.053373 -0.050142 -0.295353 -0.303787 -0.224780 -0.181541 -0.071178 0.461268 0.121636 0.123719 -0.150688 -0.126496 -0.030107 -0.030020 0.294506 -0.164077 -0.121752 0.181073 0.150483 0.233568 0.237040
polarizability: 3.06055028e+02 -7.48507221e+00 2.25220622e+02 -6.10647130e+00 4.29166074e+00 1.06608180e+02
1716.lowfreq: -11.5083 -6.6174 -4.0129 -0.0019 -0.0010 -0.0009 2.8107 22.9664 25.3725
frequency: -9.6362 22.9129 25.2727 33.4751 37.2167 41.6411 50.3301 53.4040 69.3086 84.6793 113.1097 120.5459 149.8637 162.8216 177.6341 195.9875 205.9090 234.6174 240.9647 254.9856 282.8273 304.9519 314.3343 378.3001 399.1567 413.4020 467.0209 505.7217 518.0739 538.1792 542.6337 580.6069 583.7070 625.3389 634.3610 681.0365 684.4759 685.2772 753.6373 755.0741 777.9109 783.5174 790.3482 805.2339 842.1986 859.3844 932.5702 949.1256 975.3429 978.1981 993.3868 996.0074 997.2741 1029.9604 1040.2362 1043.7594 1075.1296 1116.3500 1116.6466 1138.8905 1146.1410 1155.5351 1180.2359 1201.7303 1207.4790 1218.8101 1226.0600 1250.4049 1256.1368 1265.6779 1282.0696 1295.9254 1321.6475 1336.9491 1348.5015 1350.9567 1373.2943 1391.9468 1424.3494 1432.8780 1451.8764 1454.7320 1460.0129 1461.8595 1463.7056 1476.4234 1480.6437 1495.1983 1524.5828 1546.8563 1591.1306 1626.4384 1663.2971 2988.2848 3010.6076 3011.6193 3014.0781 3024.0865 3061.0910 3063.8828 3071.0665 3077.2950 3115.8128 3119.5813 3145.7967 3148.0800 3149.0969 3154.3100 3160.8964 3168.9788 3573.2821
redmass: 5.7764 6.7369 6.8071 5.7114 7.6354 4.1778 5.6120 5.6945 1.2122 3.7140 2.8698 2.7619 4.4614 4.5071 2.7221 8.8937 4.2452 6.8087 4.1568 3.9551 5.6145 4.8463 5.7946 6.5225 4.4972 2.9042 3.4068 2.2872 4.9765 2.3021 4.3372 1.6380 4.9096 4.5957 7.0442 5.4420 4.2171 5.3821 4.0183 4.2539 1.1331 4.9869 1.2607 1.4143 1.6074 6.4552 1.4317 2.8169 7.7515 2.0302 1.3959 1.8703 2.0214 4.1522 1.6185 3.5171 4.0084 1.2642 1.5360 1.3879 1.4870 3.5828 1.5885 2.3103 1.0821 2.0886 1.5257 1.1595 1.1619 1.6832 1.3384 1.2121 1.3852 1.7107 1.5727 1.2436 5.0943 1.5945 1.1743 3.4849 1.0492 1.1084 1.1239 1.0963 1.0809 1.7743 1.1374 1.0900 2.8547 7.5336 7.1563 6.2961 10.0126 1.0600 1.0293 1.0607 1.0624 1.0993 1.0569 1.0564 1.1027 1.1021 1.1050 1.0883 1.1102 1.0933 1.1073 1.1053 1.0932 1.0954 1.0775
irintensity: 2.5431 1.8121 3.4494 1.6112 0.8886 0.4668 3.0094 0.7397 0.2341 0.8236 0.8764 1.3032 2.3342 1.1381 12.8023 5.1707 1.9041 5.8110 9.4813 2.3214 7.6615 11.8488 8.6298 11.0242 5.0824 2.7717 1.1269 2.9284 32.2362 14.4605 17.7697 81.9633 4.5565 13.1417 2.0864 67.1943 37.1373 68.9996 6.6126 29.4582 5.3341 14.5495 9.3940 15.7856 42.0999 21.4360 0.6774 27.4089 54.3311 2.2334 1.1123 5.6245 0.6542 0.0506 1.3916 1.0066 4.1802 0.0122 34.8334 19.5126 9.2965 82.2490 75.5608 185.5626 0.2356 13.3867 101.1286 11.0554 12.1571 131.8948 23.8842 5.6893 6.6584 88.2157 80.6662 0.9245 0.5038 30.1634 17.3433 27.9318 15.1173 5.0983 33.0538 42.6355 33.0563 721.1744 92.7531 38.0635 53.8450 52.1499 139.0743 320.4434 200.3712 33.5371 28.6027 11.1720 40.7063 5.4451 11.9519 25.4854 5.3565 15.1979 21.5767 25.7440 3.2335 14.9293 14.4607 11.9852 20.4552 14.9917 54.4630
temp: 298.150 k
press: 1.00000 atm
elementType: 17 17 8 8 8 7 7 6 6 6 6 6 6 6 6 6 6 6 6 6 6 1 1 1 1 1 1 1 1 1 1 1 1 1 1 1 1 1 1
symmnumber: 1
zpe: 799019.3 jmol-1
zpe.correction: 0.304330 hartree
zpe.thermalcorrener: 0.326312 hartree
zpe.thermalcorrenthalpy: 0.327256 hartree
zpe.thermalcorrgfe: 0.248427 hartree
zpe.sumelectzpe: -1798.009286 hartree
zpe.sumelectthermal: -1797.987304 hartree
zpe.sumelectthermalent: -1797.986360 hartree
zpe.sumelectthermalfe: -1798.065189 hartree
dipole: -1.3683 5.0062 0.3716
dipole: 5.2031
quadrupole: -153.5893 -153.9892 -137.7352
quadrupole: 21.5670 -2.4364 -0.3000
quadrupole: -5.1514 -5.5513 10.7027 21.5670 -2.4364 -0.3000
hfenergy: -1798.3136162 hartree
pointgroup: C01 [X(C14H18Cl2N2O3)]
dipole: 0.6017953 1.8807286 -0.539612 debye
polarizability: 306.595595|4.3101112|218.0634291|-3.8690732|-27.7786949|113.2248054 unknown
InChI: InChI=1S/C14H18Cl2N2O3/c1-21-13(19)10-17-14(20)11-2-4-12(5-3-11)18(8-6-15)9-7-16/h2-5,17H,6-10H2,1H3
charge 0 multiplicity 1
39 atoms
Cl 4.27842 4.097012 -0.521333
Cl 6.172351 -2.477443 1.299135
O  -2.401267 -2.634384 0.507816
O  -4.816596 1.495802 -0.185496
O  -6.716625 0.206791 0.218476
N  3.440633 0.02548 -0.588815
N  -3.111261 -0.482164 0.063383
C  2.082498 -0.301315 -0.383723
C  3.836595 1.374503 -1.030283
C  4.501523 -0.976309 -0.376182
C  1.045913 0.660732 -0.597685
C  1.685892 -1.611127 0.033954
C  3.902472 2.368793 0.146509
C  4.880316 -1.111176 1.112537
C  -0.695553 -0.981617 -0.011797
C  -0.306521 0.320568 -0.418924
C  0.332059 -1.934124 0.206384
C  -2.110692 -1.428943 0.204006
C  -4.507827 -0.866528 0.255509
C  -5.476912 0.294304 0.103259
C  -5.688147 2.686586 -0.34923
H  4.828437 1.318163 -1.511135
H  3.13583 1.753306 -1.796142
H  4.190144 -1.961037 -0.768863
H  5.395958 -0.676404 -0.949161
H  1.283801 1.680576 -0.912968
H  2.430721 -2.389603 0.221183
H  4.716258 2.137858 0.849386
H  2.94451 2.453953 0.679448
H  4.029032 -1.41429 1.738765
H  5.350133 -0.200701 1.513001
H  -1.050729 1.102349 -0.614096
H  0.033024 -2.94055 0.517777
H  -2.924423 0.497307 -0.150642
H  -4.660324 -1.314713 1.257225
H  -4.804817 -1.657902 -0.460772
H  -6.260885 2.864434 0.575694
H  -6.387324 2.529308 -1.186858
H  -4.998113 3.516006 -0.556546
