program: Gaussian 09
title: 000256874
version: EM64L-G09RevD.01
frameworkgroup: C1[X(C19H22Cl2N2O2)]
method: RPBEPBE
basis: SDD
operation: Freq
keyword: #p
keyword: freq=noraman
keyword: PBEPBE/SDD
title: #p freq=noraman PBEPBE/SDD
converged: YES YES NO NO
title: Mulliken charges:
elementType: Cl Cl O O N N C C C C C C C C C C C C C C C C C C C H H H H H H H H H H H H H H H H H H H H H H
charge: -0.062080 -0.059375 -0.477414 -0.284080 -0.129437 -0.419668 0.463737 -0.420145 -0.420694 -0.189219 -0.435825 0.295612 -0.378777 -0.360056 0.436378 -0.377617 -0.391344 0.154302 -0.555092 -0.556183 -0.414982 -0.399836 -0.229820 -0.220521 -0.242442 0.240448 0.275929 0.237400 0.278053 0.256528 0.244171 0.256141 0.223824 0.226595 0.307072 0.202561 0.273448 0.267038 0.290966 0.288775 0.265840 0.244603 0.278457 0.344853 0.224218 0.222213 0.225445
chargesum: 0.00000
title: Mulliken charges with hydrogens summed into heavy atoms:
elementType: Cl Cl O O N N C C C C C C C C C C C C C C C C C C C
charge: -0.062080 -0.059375 -0.132561 -0.284080 -0.129437 -0.112596 0.463737 0.096233 0.094760 0.067309 0.064487 0.295612 -0.154953 -0.133461 0.436378 -0.175056 -0.117897 0.154302 0.002912 -0.001568 -0.170379 -0.121379 -0.005603 0.001692 -0.016997
polarizability: 4.07767009e+02 1.46262801e+01 1.95614227e+02 -8.32292914e+00 3.77215527e+01 1.79914083e+02
1716.lowfreq: -11.5576 -2.9650 -2.6651 -0.0005 0.0013 0.0015 14.1813 17.9531 21.2983
frequency: 13.0842 16.9887 21.2372 30.0872 33.9236 41.1869 59.3422 74.2220 75.9394 84.2550 88.5968 95.8076 120.2892 157.3798 166.7391 193.8794 217.1964 239.3307 245.6202 285.2654 302.9271 318.2861 330.1835 360.5174 375.9432 377.2490 404.1051 414.4109 432.7685 465.4163 486.8182 493.7907 508.4910 523.1696 544.8167 557.8739 571.6847 600.0003 606.0554 616.3221 624.7469 633.6420 685.0788 707.2086 713.5799 754.8277 758.6198 792.7089 799.7705 814.9365 833.0342 860.4210 866.9838 869.7421 884.5407 919.3695 924.4874 930.4747 948.5310 980.0818 983.3511 985.6245 989.4861 997.3623 1005.7341 1007.6180 1024.0431 1027.7769 1030.8279 1048.1596 1066.4128 1088.3629 1135.8105 1147.0737 1157.7644 1162.6209 1171.4103 1175.2128 1180.0602 1186.4043 1211.8833 1215.4440 1233.8454 1246.7807 1258.5989 1279.0001 1295.9389 1304.4665 1304.7505 1318.8236 1321.1180 1340.7618 1351.4275 1353.5528 1373.4142 1382.1968 1388.5315 1398.7236 1421.8026 1435.1431 1439.7746 1441.7808 1442.8303 1464.6598 1468.4016 1485.1626 1492.3445 1526.1507 1546.4209 1590.6072 1594.5419 1616.7807 1628.3673 2979.1025 2982.4746 2985.3617 3013.5840 3055.5639 3057.2718 3075.7872 3081.8442 3086.6308 3112.9668 3115.2033 3124.8308 3139.0101 3143.9132 3145.3665 3148.0168 3156.9722 3163.0206 3169.6169 3173.3739 3549.9128 3567.6329
redmass: 9.3794 5.5684 5.7416 9.7432 6.6221 6.0504 6.4448 5.1714 6.1106 5.1433 7.4837 4.3113 3.2528 3.8864 4.5999 6.2219 4.9362 4.5611 3.6073 3.5651 2.3246 1.9465 3.2349 3.2113 4.0955 3.6761 2.8577 2.8640 2.9314 2.9724 2.6722 2.7015 3.7640 2.5916 1.3773 2.6965 3.5025 4.7656 4.2362 6.4070 4.8820 6.6149 3.6620 1.8988 4.1015 4.0049 1.8845 2.5769 1.6477 3.5050 1.7114 1.2484 2.4027 1.8280 3.3822 1.8613 1.4468 1.3942 2.2053 3.4788 1.4475 1.3522 5.8990 1.4613 2.6857 1.8510 2.9149 2.6699 2.6882 1.8304 2.7406 1.6961 1.5432 2.6816 1.4798 1.1556 1.0605 1.3485 1.8880 1.1402 1.2696 1.2904 1.3380 1.3566 1.4846 2.1940 1.2347 1.2128 1.1861 1.3642 1.3047 1.2167 1.3654 1.5049 3.8674 5.0393 1.7639 1.7820 1.2616 2.4046 2.1495 1.0983 1.1737 1.3851 1.4018 2.4135 1.1777 2.7680 6.7097 6.7593 6.2387 6.1010 6.2960 1.0685 1.0688 1.0843 1.0589 1.0581 1.0581 1.0934 1.0931 1.1052 1.0887 1.0866 1.0875 1.0933 1.1102 1.1054 1.0920 1.0984 1.0929 1.0953 1.0962 1.0652 1.0776
irintensity: 0.0238 0.4703 0.1486 1.3516 0.3708 0.7506 1.4448 7.0355 7.3157 0.1078 4.5156 4.0647 5.2930 2.0760 0.9927 0.5330 10.8595 4.8404 28.9731 17.2180 70.7781 70.1221 21.0460 10.5250 6.0418 8.3178 1.0705 0.5086 20.6763 3.3868 2.8469 24.0311 12.3435 12.6998 53.0734 4.1754 17.0382 13.5941 24.0179 0.1720 5.3292 1.5670 19.8564 53.9432 7.2614 38.9620 32.5665 20.9502 3.1566 7.3186 39.4621 0.1746 11.7729 0.6293 20.5253 74.1547 6.3604 0.4618 14.6640 3.0162 0.1441 2.1322 0.0917 1.3637 1.4902 3.9007 27.6658 21.7571 23.4625 4.0959 2.9055 4.7371 30.1767 20.8097 59.7109 12.5209 4.1373 14.3941 55.7860 12.2061 209.3702 19.3258 71.8541 9.7168 5.2289 274.8211 0.9844 50.5938 23.3632 22.0333 9.5048 14.1867 5.8376 192.7883 1.1716 3.2436 30.1778 12.4606 62.6182 9.9563 12.0282 0.2916 20.2372 273.2165 247.2870 18.7920 29.3579 86.6926 27.2146 145.3441 2.5886 13.5087 363.2642 33.5643 20.5953 11.6333 34.6873 18.9847 14.8574 1.5030 6.5851 8.4603 26.9398 7.3794 2.8565 34.2928 17.7983 25.5667 0.3454 33.7155 20.6096 17.5994 8.7962 2.7299 12.7092
temp: 298.150 k
press: 1.00000 atm
elementType: 17 17 8 8 7 7 6 6 6 6 6 6 6 6 6 6 6 6 6 6 6 6 6 6 6 1 1 1 1 1 1 1 1 1 1 1 1 1 1 1 1 1 1 1 1 1 1
symmnumber: 1
zpe: 984685.7 jmol-1
zpe.correction: 0.375047 hartree
zpe.thermalcorrener: 0.400001 hartree
zpe.thermalcorrenthalpy: 0.400945 hartree
zpe.thermalcorrgfe: 0.314672 hartree
zpe.sumelectzpe: -1915.455477 hartree
zpe.sumelectthermal: -1915.430523 hartree
zpe.sumelectthermalent: -1915.429579 hartree
zpe.sumelectthermalfe: -1915.515852 hartree
dipole: 3.6649 0.3910 2.6559
dipole: 4.5429
quadrupole: -171.4075 -164.1506 -160.5328
quadrupole: 4.0146 -9.0584 14.9157
quadrupole: -6.0439 1.2131 4.8308 4.0146 -9.0584 14.9157
hfenergy: -1915.8305242 hartree
pointgroup: C01 [X(C19H22Cl2N2O2)]
dipole: -1.4301585 0.1518555 1.0611651 debye
polarizability: 407.4538059|18.5175608|172.9492056|1.3103139|-35.6062649|202.8923073 unknown
InChI: InChI=1S/C19H22Cl2N2O2/c20-10-12-23(13-11-21)17-8-6-16(7-9-17)19(25)22-14-18(24)15-4-2-1-3-5-15/h1-9,18,22,24H,10-14H2
charge 0 multiplicity 1
47 atoms
Cl -7.103103 2.358973 0.658496
Cl -6.628803 -3.000865 -0.121339
O  3.560633 -1.773499 0.761434
O  1.254877 0.936756 -1.508979
N  -4.965592 -0.121665 0.111212
N  1.58177 0.387853 0.71982
C  -3.575389 0.033705 0.007286
C  -5.868649 0.377456 -0.938305
C  -5.574831 -0.779172 1.277823
C  3.792273 -0.549789 -0.02146
C  3.030678 0.642481 0.629452
C  -0.712195 0.370221 -0.199991
C  -2.689967 -0.435521 1.031858
C  -2.973709 0.663545 -1.131833
C  5.285194 -0.269556 -0.060936
C  -1.299342 -0.264068 0.926093
C  -1.583879 0.815208 -1.227307
C  0.756945 0.584766 -0.389111
C  -6.122776 1.891257 -0.893781
C  -5.517298 -2.313745 1.249516
C  5.796769 0.636515 -1.024489
C  6.169043 -0.860427 0.873823
C  7.173376 0.951699 -1.050038
C  7.547044 -0.546291 0.845718
C  8.053651 0.362224 -0.112284
H  -5.464761 0.127169 -1.940176
H  -6.827715 -0.160033 -0.858842
H  -5.081716 -0.435285 2.209726
H  -6.624517 -0.451864 1.35593
H  3.401473 -0.675652 -1.051872
H  3.423863 0.800808 1.649001
H  3.204298 1.551586 0.026303
H  -3.079444 -0.943654 1.917991
H  -3.590025 1.036425 -1.954222
H  1.164572 0.280809 1.644179
H  -0.677638 -0.669992 1.734169
H  -1.134614 1.28696 -2.107665
H  -6.746396 2.219959 -1.739712
H  -5.197152 2.481056 -0.835238
H  -4.51372 -2.701742 1.024553
H  -5.907943 -2.748472 2.182906
H  5.120443 1.085436 -1.763102
H  5.767354 -1.576382 1.596515
H  2.583377 -1.941071 0.760159
H  7.559152 1.649153 -1.802271
H  8.226182 -1.0141 1.567929
H  9.122707 0.602824 -0.133836
