program: Gaussian 09
title: 000256872
version: EM64L-G09RevD.01
frameworkgroup: C1[X(C19H20Cl2N2)]
method: RPBEPBE
basis: SDD
operation: Freq
keyword: #p
keyword: freq=noraman
keyword: PBEPBE/SDD
title: #p freq=noraman PBEPBE/SDD
converged: YES YES NO NO
title: Mulliken charges:
elementType: Cl Cl N N C C C C C C C C C C C C C C C C C C C H H H H H H H H H H H H H H H H H H H H
charge: -0.058079 -0.059116 -0.170217 -0.048985 0.374156 0.153149 -0.586015 -0.064562 0.367422 -0.486761 0.441450 -0.388677 -0.391247 -0.423631 -0.416947 -0.369253 -0.385002 -0.440012 -0.382026 -0.230473 -0.257585 -0.584648 -0.584360 0.222108 0.231184 0.218871 0.231970 0.252017 0.247556 0.250536 0.248552 0.270072 0.262787 0.230966 0.231701 0.238600 0.270076 0.229635 0.229887 0.267461 0.294392 0.268654 0.294391
chargesum: 0.00000
title: Mulliken charges with hydrogens summed into heavy atoms:
elementType: Cl Cl N N C C C C C C C C C C C C C C C C C C C
charge: -0.058079 -0.059116 -0.170217 -0.048985 0.374156 0.153149 -0.132724 -0.064562 0.367422 -0.035920 0.441450 0.110896 0.107841 -0.153559 -0.154160 -0.138287 -0.153301 -0.201412 -0.111950 -0.000838 -0.027698 -0.022795 -0.021315
polarizability: 3.76857774e+02 -4.13189303e+00 2.35365161e+02 8.94127922e+00 3.67684679e+01 1.69237964e+02
1716.lowfreq: -8.5336 -5.0388 -0.0026 -0.0019 -0.0012 2.9093 18.8274 24.9709 29.3521
frequency: 18.7776 24.8598 29.3226 32.4017 61.1978 70.4111 78.4361 102.5416 124.8473 130.4916 161.1172 177.4146 184.2416 208.3793 233.2142 240.1882 273.8218 279.9010 309.1545 333.2426 374.8742 401.8789 420.7928 423.6334 441.5040 477.0554 501.8876 508.1301 524.8857 552.1503 575.1089 604.1176 634.0091 661.5258 671.3488 691.6137 695.4721 735.9114 751.1421 752.4194 780.9742 782.6745 785.2747 788.8918 814.3006 829.6960 845.3300 883.9589 921.6119 949.9735 952.4388 962.9223 964.7709 973.6912 994.3255 999.1457 1002.4986 1008.3885 1034.6833 1035.5628 1036.9917 1041.9183 1053.8033 1106.7393 1118.9531 1136.9845 1152.0223 1167.2882 1175.1145 1182.5152 1210.2193 1211.6877 1221.3567 1224.2987 1255.9049 1257.0491 1276.0645 1279.6491 1292.0722 1301.6661 1313.3826 1322.3379 1350.5255 1351.2073 1354.2320 1367.1206 1380.1939 1386.8590 1430.9283 1437.0513 1447.5188 1454.9741 1458.4453 1459.0674 1475.1748 1483.9224 1503.3561 1517.1938 1534.1006 1561.6811 1588.5006 1609.4042 1624.4774 2947.6398 2967.2259 3013.5134 3019.1859 3047.9320 3051.6065 3061.9960 3063.8592 3069.7607 3075.4988 3120.2987 3132.5626 3136.7095 3143.8943 3147.2322 3148.5974 3148.8599 3159.6440 3163.7780 3166.7109
redmass: 7.1205 6.6857 13.7408 10.5365 4.7774 5.2833 3.4292 2.6560 3.0940 3.1520 3.8705 5.4391 6.1779 4.4778 4.2058 4.2425 4.3705 3.1596 3.4156 3.9034 5.1241 2.9916 4.0948 3.2984 3.0102 3.4815 4.8735 4.6015 3.8640 3.4778 4.4650 3.1738 6.6197 4.5838 5.0643 4.3280 5.0938 4.1327 3.0157 2.2238 2.3459 1.4692 1.9880 1.1710 1.2780 1.7793 2.7814 1.3320 3.1612 2.0369 1.8304 2.7590 1.4637 1.4135 1.3195 1.4378 2.7983 2.6420 4.4848 2.2953 2.4548 1.9064 2.3968 2.0954 1.5276 1.3815 1.2626 1.7038 1.0856 1.6311 1.6265 1.2726 2.0576 1.6314 1.1632 1.1624 1.3376 1.3560 1.1918 1.4590 2.3664 1.6884 1.3100 1.4007 1.4218 5.1323 6.6108 1.8556 3.5104 2.0558 1.1927 1.1344 1.0967 1.0960 2.6259 1.0913 1.1439 2.5868 5.8491 6.7110 7.1405 6.5420 6.3299 1.0693 1.0636 1.0600 1.0608 1.0959 1.0940 1.0577 1.0593 1.1012 1.1036 1.0865 1.0889 1.0877 1.0893 1.1095 1.1070 1.0982 1.0949 1.0996 1.0962
irintensity: 0.1348 0.0386 1.1109 0.2838 1.6383 1.9130 0.7417 0.9135 2.3834 0.0651 1.4419 1.6187 0.0705 3.5200 5.0321 14.5300 3.0024 2.7684 6.5912 4.8237 11.9140 1.7913 0.5962 0.3587 2.1558 2.7818 3.9093 5.1661 22.4967 6.2950 7.2333 4.5392 6.7796 56.0985 54.7464 39.2582 55.1439 9.6363 21.8853 34.2863 0.5734 2.3638 22.7559 10.0553 5.5686 55.3060 7.3982 0.4391 21.6996 21.2047 15.3297 1.6892 0.1665 1.5112 0.0361 3.6377 1.5408 8.9290 0.5245 0.8668 6.7753 0.8196 8.8975 6.7384 35.4525 8.1355 13.7183 10.5085 18.2712 68.9287 34.8621 39.1066 30.3024 24.2911 18.4295 18.5277 57.8646 2.2629 7.7577 27.6272 64.7357 64.6468 33.1187 38.8793 51.0409 4.2248 0.2756 97.4507 12.7184 0.2255 23.3815 5.9689 12.6847 9.2906 5.4698 25.4635 0.4697 242.4210 61.4048 15.4254 42.9182 6.8926 299.6376 49.3926 30.3016 23.9176 22.2954 44.5335 49.7505 13.5932 14.0086 11.2822 9.2510 5.8468 6.3399 26.2265 17.6418 7.3566 1.0120 38.0327 17.0316 29.3917 9.9266
temp: 298.150 k
press: 1.00000 atm
elementType: 17 17 7 7 6 6 6 6 6 6 6 6 6 6 6 6 6 6 6 6 6 6 6 1 1 1 1 1 1 1 1 1 1 1 1 1 1 1 1 1 1 1 1
symmnumber: 1
zpe: 907277.8 jmol-1
zpe.correction: 0.345564 hartree
zpe.thermalcorrener: 0.366878 hartree
zpe.thermalcorrenthalpy: 0.367823 hartree
zpe.thermalcorrgfe: 0.291802 hartree
zpe.sumelectzpe: -1763.978419 hartree
zpe.sumelectthermal: -1763.957104 hartree
zpe.sumelectthermalent: -1763.956160 hartree
zpe.sumelectthermalfe: -1764.032181 hartree
dipole: -1.8094 1.0596 0.8665
dipole: 2.2688
quadrupole: -139.4138 -165.1675 -148.1262
quadrupole: -1.8540 -0.6689 4.7086
quadrupole: 11.4887 -14.2650 2.7763 -1.8540 -0.6689 4.7086
hfenergy: -1764.3239828 hartree
pointgroup: C01 [X(C19H20Cl2N2)]
dipole: -0.7031788 -0.0548863 0.5470787 debye
polarizability: 375.3971806|-20.2452194|155.2931326|-1.4931334|10.218221|250.7705855 unknown
InChI: InChI=1S/C19H20Cl2N2/c20-10-13-23(14-11-21)17-7-5-16(6-8-17)19-18-4-2-1-3-15(18)9-12-22-19/h1-8H,9-14H2
charge 0 multiplicity 1
43 atoms
Cl 5.834609 -2.582986 -2.47864
Cl 5.211548 2.266787 3.04857
N  3.640071 -0.096004 0.01853
N  -2.467202 0.349727 -2.064196
C  -4.388814 0.483501 0.122717
C  -3.076767 -0.056413 0.300032
C  -4.672574 1.2008 -1.185701
C  -2.08851 0.125841 -0.816061
C  -0.62065 0.038285 -0.558917
C  -3.927085 0.469168 -2.325407
C  2.24062 -0.045377 -0.174786
C  4.550662 -0.533375 -1.053669
C  4.249277 0.290786 1.302332
C  0.250854 -0.414143 -1.584947
C  -0.026188 0.464702 0.657984
C  1.641349 -0.469512 -1.40299
C  1.367502 0.434085 0.848953
C  -5.359159 0.309852 1.132371
C  -2.790091 -0.806139 1.47121
C  -5.054165 -0.412732 2.309704
C  -3.770458 -0.982462 2.472009
C  4.672867 -2.068992 -1.077595
C  4.461947 1.815246 1.371726
H  -5.757922 1.24816 -1.387809
H  -4.299955 2.245518 -1.135034
H  -4.351312 -0.550346 -2.460448
H  -4.049549 1.004326 -3.283006
H  4.20925 -0.166103 -2.037257
H  5.549516 -0.094188 -0.883024
H  3.62557 -0.041939 2.150883
H  5.224884 -0.215463 1.409852
H  -0.192805 -0.719074 -2.538005
H  -0.655116 0.864394 1.460621
H  2.2568 -0.848013 -2.224456
H  1.766298 0.801296 1.799185
H  -6.362019 0.731163 0.992676
H  -1.805384 -1.269469 1.587942
H  -5.816931 -0.544083 3.085462
H  -3.536642 -1.564724 3.370128
H  5.120764 -2.466536 -0.154605
H  3.712981 -2.563304 -1.28378
H  5.178168 2.172001 0.616729
H  3.518262 2.374439 1.301019
