program: Gaussian 09
title: 000256871
version: EM64L-G09RevD.01
frameworkgroup: C1[X(C19H21Cl3N2O)]
method: RPBEPBE
basis: SDD
operation: Freq
keyword: #p
keyword: freq=noraman
keyword: PBEPBE/SDD
title: #p freq=noraman PBEPBE/SDD
converged: YES YES NO NO
title: Mulliken charges:
elementType: Cl Cl Cl O N N C C C C C C C C C C C C C C C C C C C H H H H H H H H H H H H H H H H H H H H H
charge: -0.063377 -0.061722 -0.060871 -0.293229 -0.130722 -0.397132 0.467389 -0.418465 -0.421010 -0.547561 -0.381628 0.304910 -0.360550 -0.388905 -0.403251 -0.361998 -0.555216 -0.555903 0.487462 0.149264 -0.390281 -0.403461 -0.210054 -0.218505 -0.108390 0.239430 0.274438 0.237914 0.277131 0.216570 0.233636 0.221672 0.265603 0.225154 0.223368 0.273216 0.205207 0.265654 0.291119 0.265295 0.289139 0.313163 0.240678 0.253486 0.255340 0.255996
chargesum: 0.00000
title: Mulliken charges with hydrogens summed into heavy atoms:
elementType: Cl Cl Cl O N N C C C C C C C C C C C C C C C C C C C
charge: -0.063377 -0.061722 -0.060871 -0.293229 -0.130722 -0.083969 0.467389 0.095403 0.094035 -0.097356 0.105647 0.304910 -0.135397 -0.165537 -0.130036 -0.156791 0.001557 -0.001469 0.487462 0.149264 -0.149603 -0.149975 0.045286 0.037491 -0.108390
polarizability: 3.30334854e+02 2.25760473e+01 2.82063459e+02 -2.67994788e+01 2.60644085e+01 1.70759544e+02
1716.lowfreq: -15.3620 -8.1167 -5.7022 -0.0019 0.0003 0.0007 3.5887 10.9095 16.9426
frequency: -11.9817 10.7187 16.5282 23.0463 28.9592 39.4347 49.1341 58.8626 72.1394 79.8516 86.9499 93.3515 114.8045 138.8302 167.1324 190.1271 195.0184 236.4925 272.6709 290.0167 304.1140 324.2984 341.5357 353.1001 374.6920 376.3810 409.1895 414.2295 421.6182 443.1568 474.4800 491.0884 497.8287 530.6718 547.3769 555.7872 566.6805 600.1970 606.2062 610.3137 626.7669 633.4372 682.7301 704.9695 716.7796 754.9607 761.1732 793.5202 803.4821 829.2510 832.2331 832.7287 866.4147 868.8438 870.9817 918.5210 934.1606 948.6798 949.9118 964.0201 967.8083 985.8998 990.0691 1000.0135 1006.1033 1013.2259 1029.6999 1046.9696 1059.9360 1071.7487 1108.4107 1136.1450 1145.3721 1158.9588 1173.8124 1178.6760 1183.5316 1184.4018 1210.8648 1215.2794 1233.0894 1239.3712 1258.9944 1282.6931 1292.8535 1295.9321 1303.7901 1315.3888 1320.9593 1349.4753 1354.9464 1358.3409 1373.6627 1375.7058 1387.2121 1394.3761 1432.4074 1438.3284 1439.8210 1451.3432 1467.8083 1469.7735 1476.8699 1486.2721 1496.2935 1527.0329 1548.7642 1584.7019 1595.0581 1598.7177 1627.9316 2978.5406 2982.7098 2993.6916 2997.2495 3055.1836 3055.8008 3062.2077 3073.9978 3078.7808 3080.6972 3112.0236 3126.9100 3134.1035 3143.9386 3144.2830 3147.3823 3162.7511 3166.5106 3168.9989 3169.8878 3568.5436
redmass: 8.5566 12.0432 6.4447 5.3985 7.9154 11.1594 8.4003 5.1446 6.1628 5.3308 5.1970 3.9792 3.9051 4.5776 4.4044 4.3235 6.7462 5.1048 5.1847 4.0338 5.3145 4.4186 3.1215 6.6268 3.1797 2.5221 2.8962 2.8499 3.2120 2.7945 2.4317 2.9659 2.9836 2.0960 2.0222 2.2257 3.4743 4.7260 4.2697 3.8807 6.8232 6.7476 3.7996 3.6535 3.5790 4.4399 3.7791 2.4003 1.4386 1.9247 1.3622 1.5702 2.3569 1.8339 2.4172 1.8766 1.3899 2.2056 1.3549 2.2882 1.5228 1.3637 3.0619 4.1628 1.8332 2.2125 2.4554 1.8806 2.9284 2.7236 1.4072 1.5390 2.2975 1.1780 1.3740 1.7937 1.1300 1.2331 2.4126 1.2542 1.3509 1.3011 1.4817 2.1663 1.2594 1.2845 1.1963 1.3126 1.3587 1.3501 1.4932 1.3786 4.2439 6.0293 1.7689 2.6014 2.6442 1.1144 1.1782 1.1440 1.1364 1.1526 2.2118 1.5586 1.3067 2.7333 6.5789 7.2747 6.4090 6.2635 6.2743 1.0683 1.0684 1.0632 1.0621 1.0582 1.0579 1.0999 1.0937 1.1009 1.0933 1.0887 1.0898 1.0897 1.1082 1.1090 1.0903 1.0926 1.0952 1.0952 1.0961 1.0769
irintensity: 0.3878 0.1763 0.0540 2.1995 1.2600 5.4676 2.8142 0.1693 7.4856 1.6360 2.9119 2.5933 3.3748 2.6184 0.5497 5.2738 0.1795 0.7256 0.8948 3.4953 3.3990 0.6084 17.7159 7.8950 2.8376 0.1442 0.3022 2.0737 0.9926 39.4493 8.9436 3.3394 13.6103 17.9894 104.6472 31.5921 8.1650 13.5959 24.3688 18.5157 0.1019 0.8452 17.8772 0.3506 8.6358 18.1590 7.2447 26.1847 3.2534 24.4661 12.6731 45.2425 6.2378 0.5400 31.0660 69.8915 1.0330 13.9836 0.3712 5.1610 2.2117 2.5002 1.6628 34.0386 4.0727 8.8699 7.1585 8.2210 12.6141 35.9204 9.7673 23.4290 11.0524 19.1523 11.6629 56.3801 2.4476 5.7082 20.9786 155.7367 57.3621 11.3350 5.2701 333.3024 9.1339 1.5926 26.4201 27.4075 4.6877 5.7589 178.3587 9.5359 1.4843 0.3578 34.8145 3.5109 25.2082 1.2119 11.3497 26.7911 23.7769 22.7410 143.7752 251.1605 204.0804 71.5575 22.9193 1.8620 166.4135 18.1702 319.3070 31.2889 22.6666 34.3837 46.6080 23.2736 11.0345 25.3640 1.9079 6.0616 6.7687 28.0117 10.4733 11.2123 12.4836 29.8008 0.7097 19.5251 7.6532 17.1202 0.3875 9.9634
temp: 298.150 k
press: 1.00000 atm
elementType: 17 17 17 8 7 7 6 6 6 6 6 6 6 6 6 6 6 6 6 6 6 6 6 6 6 1 1 1 1 1 1 1 1 1 1 1 1 1 1 1 1 1 1 1 1 1
symmnumber: 1
zpe: 949533.6 jmol-1
zpe.correction: 0.361658 hartree
zpe.thermalcorrener: 0.385846 hartree
zpe.thermalcorrenthalpy: 0.386791 hartree
zpe.thermalcorrgfe: 0.302037 hartree
zpe.sumelectzpe: -2299.711643 hartree
zpe.sumelectthermal: -2299.687455 hartree
zpe.sumelectthermalent: -2299.686510 hartree
zpe.sumelectthermalfe: -2299.771264 hartree
dipole: 0.2403 1.0430 1.1066
dipole: 1.5395
quadrupole: -160.7501 -181.7105 -179.5020
quadrupole: 4.2452 -7.8460 -1.7322
quadrupole: 13.2374 -7.7229 -5.5145 4.2452 -7.8460 -1.7322
hfenergy: -2300.0733012 hartree
pointgroup: C01 [X(C19H21Cl3N2O1)]
dipole: -0.0854112 0.4641288 -0.3796782 debye
polarizability: 331.2686507|-18.8357713|287.0665916|-26.3672972|-10.9894614|164.8226137 unknown
InChI: InChI=1S/C19H21Cl3N2O/c20-10-13-24(14-11-21)18-7-3-16(4-8-18)19(25)23-12-9-15-1-5-17(22)6-2-15/h1-8,23H,9-14H2
charge 0 multiplicity 1
46 atoms
Cl -6.38801 0.517499 -2.53758
Cl -5.182507 2.735227 2.289186
Cl 5.365047 4.009278 -0.381614
O  0.746977 -3.616572 0.387463
N  -4.154504 0.646996 -0.093434
N  1.925434 -1.839619 -0.542055
C  -2.951191 -0.076802 -0.07751
C  -5.451114 -0.027701 0.074091
C  -4.161232 2.106589 -0.273435
C  4.181212 -1.974021 0.580432
C  3.216507 -2.533384 -0.510486
C  -0.475793 -1.568485 -0.069347
C  -2.931316 -1.496886 0.118555
C  -1.685536 0.572016 -0.250034
C  -1.724661 -2.210817 0.129078
C  -0.48619 -0.160689 -0.250201
C  -5.967466 -0.740063 -1.184533
C  -3.813512 2.905996 0.990882
C  4.503222 -0.502359 0.378462
C  0.760243 -2.417995 -0.047799
C  5.530428 -0.095679 -0.513461
C  3.749503 0.505222 1.036425
C  5.801162 1.270635 -0.752225
C  4.004039 1.878581 0.81343
C  5.026925 2.238716 -0.083857
H  -5.389921 -0.776091 0.890176
H  -6.1932 0.716773 0.406126
H  -3.443594 2.394803 -1.068406
H  -5.154372 2.411328 -0.641846
H  5.107691 -2.579269 0.548871
H  3.712647 -2.138026 1.567525
H  3.697318 -2.461208 -1.504964
H  2.999956 -3.595046 -0.301056
H  -3.860529 -2.053065 0.268725
H  -1.626008 1.655758 -0.381214
H  -1.719033 -3.293628 0.293002
H  0.449446 0.40224 -0.362313
H  -6.907783 -1.277788 -0.986049
H  -5.221217 -1.407816 -1.637659
H  -3.747045 3.985128 0.781519
H  -2.902515 2.543636 1.487733
H  1.897176 -0.896666 -0.929389
H  6.134788 -0.853865 -1.026169
H  2.962619 0.216106 1.742875
H  6.598186 1.574404 -1.43717
H  3.425526 2.648408 1.332553
