program: Gaussian 09
title: 000256859
version: EM64L-G09RevD.01
frameworkgroup: C1[X(C20H23N3O3)]
method: RPBEPBE
basis: SDD
operation: Freq
keyword: #p
keyword: freq=noraman
keyword: PBEPBE/SDD
title: #p freq=noraman PBEPBE/SDD
converged: YES YES NO NO
title: Mulliken charges:
elementType: O O O N N N C C C C C C C C C C C C C C C C C C C C H H H H H H H H H H H H H H H H H H H H H H H
charge: -0.207959 -0.248247 -0.266095 -0.171504 -0.398499 -0.487400 -0.399630 -0.379044 -0.383484 -0.382816 -0.375375 0.131355 0.522170 0.190163 -0.325910 -0.337869 -0.347400 -0.356678 0.327399 0.488381 -0.453366 -0.335517 -0.199950 -0.216152 -0.258358 -0.538960 0.191064 0.227406 0.214364 0.201374 0.208949 0.228788 0.218301 0.258077 0.260422 0.206497 0.249135 0.222251 0.344882 0.240634 0.248286 0.217173 0.305728 0.224535 0.225644 0.228244 0.244194 0.222350 0.222449
chargesum: 0.00000
title: Mulliken charges with hydrogens summed into heavy atoms:
elementType: O O O N N N C C C C C C C C C C C C C C C C C C C C
charge: -0.207959 -0.248247 -0.266095 -0.171504 -0.398499 -0.142517 0.018840 0.036694 0.054253 0.093562 0.091544 0.131355 0.522170 0.190163 -0.076774 -0.115618 -0.106765 -0.108393 0.327399 0.488381 -0.236194 -0.029789 0.024585 0.009492 -0.030114 0.150033
polarizability: 3.56579473e+02 -4.07911194e-01 2.61409397e+02 -5.26612161e+00 7.76561881e+00 1.60760365e+02
1716.lowfreq: -3.9583 -0.0003 0.0004 0.0005 2.9891 5.4662 13.4833 23.3360 29.0831
frequency: 13.1759 23.3225 29.0784 37.2041 40.6018 50.2616 64.6560 86.4198 94.5361 112.1015 120.3993 148.8754 174.4002 195.2114 198.3217 215.6250 246.3659 250.5452 266.4806 283.7888 340.2733 351.1592 370.1493 383.8098 406.1594 409.4454 415.0459 416.7575 439.6586 452.0331 501.1906 509.7563 516.3712 535.1516 573.2738 592.0274 614.4941 626.0092 637.6621 662.5277 688.6405 696.9893 706.1932 719.8635 753.1527 767.2529 789.4257 798.0055 804.2219 805.9629 827.1260 839.6282 844.8194 845.8418 866.5955 905.9595 914.1128 935.1006 944.1036 950.6982 962.9873 970.8140 983.9505 988.9580 996.8428 997.8301 1006.0908 1026.3721 1035.5722 1072.7731 1086.5335 1091.2032 1112.9042 1113.2091 1116.8315 1134.2695 1155.6500 1156.5130 1166.5117 1171.7586 1178.7696 1187.8028 1208.0412 1226.0301 1230.8326 1254.1257 1269.4975 1282.9476 1286.2813 1300.0662 1321.7545 1332.2964 1337.5906 1340.6308 1351.9808 1363.8311 1377.2610 1383.6377 1391.2211 1423.5485 1434.5295 1437.4942 1450.1568 1456.2471 1460.8715 1465.1146 1467.8982 1472.1314 1473.9077 1487.3574 1500.9001 1529.5785 1585.5506 1594.3131 1601.7829 1616.4904 1623.5176 1637.9710 2959.9369 2971.2281 2972.2734 2980.2507 2985.8446 2993.1351 3040.8740 3047.7836 3047.9782 3059.2683 3094.2325 3103.4578 3106.4620 3124.8641 3130.7052 3134.0704 3142.8692 3156.8995 3164.3868 3169.9439 3179.4899 3196.9067 3465.4717
redmass: 3.8394 4.5180 5.4649 3.8220 4.7591 4.4244 4.0219 6.0767 3.7975 5.6212 5.2805 4.1529 3.7240 3.2867 3.4435 4.8820 2.5610 1.5144 2.6186 3.1252 4.5373 4.1923 4.7447 2.8255 3.5050 3.0217 3.2694 2.9694 4.7375 3.4896 3.8201 2.7445 3.1170 2.9434 2.8040 6.1810 6.1557 4.8746 6.3546 1.4132 4.9763 2.0551 8.1287 3.6910 6.3048 1.6978 3.2998 1.5571 1.3119 4.2693 2.0603 1.4064 2.3539 1.6540 3.7644 2.7113 1.4332 1.4075 1.3522 1.3650 4.0324 1.3523 5.8616 8.2505 3.0306 1.3086 2.5441 2.2146 2.2894 2.6678 1.4409 1.6374 1.3872 1.2658 2.6314 3.0974 1.3383 1.3208 2.3642 1.0698 1.2911 1.1167 2.2184 2.7231 2.6336 1.2805 2.0521 4.3558 1.2311 1.3079 1.4372 1.2822 1.3929 1.5627 1.4005 1.3425 6.2338 3.6640 2.4422 3.8177 2.3794 1.1779 1.0979 1.0887 1.1079 1.0849 1.0499 1.0976 1.0855 2.4068 2.4179 2.0696 8.0307 7.7361 6.2830 5.4888 6.1739 5.2000 1.0329 1.0654 1.0676 1.0661 1.0647 1.0610 1.0959 1.1039 1.1017 1.1029 1.0956 1.0949 1.0885 1.0994 1.0866 1.0895 1.0933 1.0879 1.0999 1.0954 1.0966 1.0948 1.0764
irintensity: 1.0390 2.5161 0.4246 0.9597 1.1265 2.1906 0.6487 3.7471 1.6909 1.7539 1.9057 1.3045 7.3240 0.3032 4.7456 4.2871 2.3730 1.8297 2.7470 2.3005 7.1626 3.1438 3.5987 3.3466 0.6930 0.1302 5.8082 0.3758 13.5044 1.5532 2.7154 22.2700 19.6684 48.7991 10.8004 10.4075 1.0929 9.1963 2.0768 13.6361 21.8989 43.6975 14.6572 0.7588 3.2467 94.4322 28.0698 0.2819 3.1731 2.6209 31.5321 2.1678 18.4951 12.9945 6.8452 4.8043 10.0551 7.0457 8.2468 0.1387 30.5966 0.1263 4.3946 25.9094 30.7065 3.4354 42.0872 8.1673 1.1302 5.7344 2.6488 21.5235 3.3989 0.0215 8.5630 374.9046 30.3505 6.5448 173.8349 5.4034 107.6612 8.2957 32.0567 242.9976 170.2883 2.3799 99.2064 42.3277 13.4527 2.3195 88.2399 0.7070 4.4769 15.4075 1.7981 24.5897 3.9083 55.4448 155.7745 1.9382 99.0594 14.3887 27.8045 8.6881 13.1509 16.8916 13.3821 18.3629 80.2356 143.8215 214.8745 570.9704 143.4741 137.3561 122.4619 74.5746 85.5519 117.9185 75.3755 18.2157 51.7785 17.0958 42.5616 27.0995 52.9902 41.2323 46.3873 68.2141 4.6743 10.1444 19.5904 29.1076 0.4370 17.2849 31.1058 14.2187 29.2008 8.5681 2.7895 7.1391 77.6026
temp: 298.150 k
press: 1.00000 atm
elementType: 8 8 8 7 7 7 6 6 6 6 6 6 6 6 6 6 6 6 6 6 6 6 6 6 6 6 1 1 1 1 1 1 1 1 1 1 1 1 1 1 1 1 1 1 1 1 1 1 1
symmnumber: 1
zpe: 1045104.8 jmol-1
zpe.correction: 0.398059 hartree
zpe.thermalcorrener: 0.421948 hartree
zpe.thermalcorrenthalpy: 0.422892 hartree
zpe.thermalcorrgfe: 0.341363 hartree
zpe.sumelectzpe: -1163.971854 hartree
zpe.sumelectthermal: -1163.947966 hartree
zpe.sumelectthermalent: -1163.947022 hartree
zpe.sumelectthermalfe: -1164.028551 hartree
dipole: -1.9144 2.5881 -0.7701
dipole: 3.3101
quadrupole: -132.9465 -135.1701 -160.9783
quadrupole: -17.7712 -1.0527 -7.8844
quadrupole: 10.0852 7.8615 -17.9467 -17.7712 -1.0527 -7.8844
hfenergy: -1164.3699137 hartree
pointgroup: C01 [X(C20H23N3O3)]
dipole: -0.8373263 -0.9606783 0.2681618 debye
polarizability: 355.6207678|-7.2537285|261.7106907|10.9936975|8.4505682|161.4177763 unknown
InChI: InChI=1S/C20H23N3O3/c1-26-18-12-10-17(11-13-18)23(20(25)22-14-6-3-7-15-22)19(24)21-16-8-4-2-5-9-16/h2,4-5,8-13,21H,3,6-7,14-15H2,1H3
charge 0 multiplicity 1
49 atoms
O  0.622287 -1.560605 -1.954212
O  -0.113272 2.057376 0.826829
O  5.994685 0.560531 0.545329
N  -1.081263 -1.916354 -0.385768
N  0.389615 -0.021771 -0.162615
N  -1.807464 0.890468 -0.309651
C  -1.567431 -4.498525 0.920713
C  -1.013052 -3.286487 1.704933
C  -1.165634 -4.412558 -0.570497
C  -1.444782 -1.947414 1.058591
C  -1.608629 -3.061269 -1.175952
C  0.013786 -1.213446 -0.903775
C  1.81601 0.189114 0.011074
C  -0.509989 1.052568 0.172707
C  2.453518 1.36205 -0.443207
C  2.584436 -0.826926 0.630611
C  3.844098 1.53108 -0.27594
C  3.972512 -0.678716 0.784935
C  4.607929 0.505469 0.335207
C  -2.918341 1.762197 -0.133446
C  -4.157024 1.337336 -0.690044
C  -2.848478 3.005731 0.550786
C  -5.308918 2.138655 -0.564028
C  -4.012856 3.795563 0.668502
C  -5.245695 3.376133 0.118653
C  6.697424 1.763503 0.093362
H  -2.674231 -4.514133 1.003615
H  -1.200694 -5.442081 1.365711
H  -1.3654 -3.303321 2.753903
H  0.093989 -3.334534 1.731198
H  -1.626217 -5.23634 -1.147869
H  -0.068226 -4.509199 -0.677037
H  -2.543286 -1.826355 1.146564
H  -0.969216 -1.099646 1.573608
H  -1.244123 -2.953313 -2.209552
H  -2.716087 -2.995426 -1.17229
H  1.865209 2.152823 -0.915848
H  2.091774 -1.738279 0.988484
H  -2.00655 0.012605 -0.800361
H  4.314352 2.453179 -0.629227
H  4.580635 -1.456922 1.255169
H  -4.212976 0.381643 -1.228335
H  -1.897722 3.330923 0.975898
H  -6.254108 1.79727 -1.000705
H  -3.950118 4.753007 1.198151
H  -6.139767 4.000742 0.217148
H  7.752423 1.595406 0.354961
H  6.601209 1.898424 -1.001636
H  6.323356 2.66723 0.612855
