program: Gaussian 09
title: 000256855
version: EM64L-G09RevD.01
frameworkgroup: C1[X(C22H29N3O2)]
method: RPBEPBE
basis: SDD
operation: Freq
keyword: #p
keyword: freq=noraman
keyword: PBEPBE/SDD
title: #p freq=noraman PBEPBE/SDD
converged: YES YES NO NO
title: Mulliken charges:
elementType: O O N N N C C C C C C C C C C C C C C C C C C C C C C H H H H H H H H H H H H H H H H H H H H H H H H H H H H H
charge: -0.323662 -0.269536 -0.116126 -0.405386 -0.486693 -0.397346 -0.363351 -0.383228 -0.356383 -0.309223 -0.342702 0.195884 -0.698964 -0.696442 0.419089 0.234292 -0.339570 -0.357292 -0.227546 -0.219531 0.466517 -0.249408 -0.446309 -0.338717 -0.198495 -0.217068 -0.258922 0.227348 0.257825 0.217219 0.245816 0.209006 0.198419 0.192681 0.233395 0.202631 0.219873 0.204766 0.189853 0.208133 0.220358 0.204656 0.209925 0.218785 0.216916 0.283358 0.250320 0.378729 0.229129 0.229119 0.230994 0.234058 0.301023 0.223272 0.222830 0.225681
chargesum: 0.00000
title: Mulliken charges with hydrogens summed into heavy atoms:
elementType: O O N N N C C C C C C C C C C C C C C C C C C C C C C
charge: -0.323662 -0.269536 -0.116126 -0.405386 -0.107965 0.087827 0.099684 0.024196 0.069693 0.113281 0.051917 0.195884 -0.065817 -0.050816 0.419089 0.234292 -0.056212 -0.106972 0.001583 0.009588 0.466517 -0.018413 -0.212251 -0.037694 0.024778 0.005762 -0.033241
polarizability: 3.44454795e+02 3.51214767e+01 2.85130188e+02 -1.25606841e+01 2.48038733e+01 1.92042909e+02
1716.lowfreq: -7.1210 -3.2470 -0.0009 -0.0009 -0.0007 5.2413 18.0991 23.3216 27.9293
frequency: 17.9114 23.1831 27.9207 31.1586 41.5070 60.2421 61.6631 64.1037 71.4773 76.7001 89.4682 94.3533 97.7823 116.8781 139.5203 141.2062 181.1806 205.4569 218.8778 225.5699 232.4046 243.1415 254.1308 273.1290 295.9842 307.0578 351.6878 357.1540 384.0687 402.5510 409.5522 410.1004 421.4213 430.5734 501.6128 506.4630 518.9137 537.8485 580.6638 611.4189 614.2337 634.7333 658.9860 693.8547 694.6217 698.4180 711.8257 735.3857 740.8004 754.4905 766.4007 783.8968 792.0371 813.5018 825.8415 837.1384 840.4239 862.5571 884.2195 889.4319 902.9374 911.3019 920.8862 932.1707 944.9903 966.3931 968.9470 974.0160 985.1452 988.6824 992.1209 996.2091 1004.1846 1016.8689 1025.5682 1029.8442 1053.4566 1067.9760 1072.6851 1085.1576 1089.4649 1102.7865 1113.3799 1119.4908 1157.1590 1163.6921 1171.5505 1171.7607 1184.9647 1188.4268 1189.5962 1226.0659 1240.2087 1244.0636 1251.2722 1270.0115 1275.9666 1288.4428 1292.3357 1299.7943 1311.0078 1317.0634 1323.1614 1345.3607 1352.3792 1364.8104 1369.2153 1379.5951 1384.0328 1390.0738 1392.2168 1396.8556 1437.8181 1439.4671 1446.2349 1467.2474 1469.9583 1473.8617 1476.6840 1477.4332 1477.9107 1478.1544 1481.5712 1486.9151 1488.2749 1488.9185 1519.4645 1569.6534 1591.1306 1605.3666 1607.6640 1618.4838 1658.3012 2958.0697 2965.1845 2970.5141 2974.9140 2975.5424 2977.8542 2985.8211 3010.2815 3011.9897 3016.9589 3039.4123 3044.6645 3068.7373 3071.9041 3073.7243 3075.5387 3089.4237 3112.7195 3119.2712 3127.7665 3129.7315 3137.0188 3142.6558 3149.2280 3162.8572 3164.0724 3187.6083 3193.2023 3227.0827
redmass: 4.3512 4.3905 4.2303 3.9094 4.2358 3.5920 5.7764 1.9584 2.8331 3.8036 2.5737 2.9886 3.4444 2.5168 3.4577 6.3411 3.5664 4.1309 2.0004 1.7785 1.1402 4.1755 4.4192 3.8691 2.4238 2.5273 6.9990 4.9680 2.9602 5.0047 2.9539 2.9249 3.8797 5.9613 3.5006 3.3045 3.1309 5.4479 5.6364 6.1389 6.3810 3.3376 6.5796 4.8843 2.0595 2.1341 6.7505 1.0833 1.2361 2.0834 1.6972 1.2842 3.7124 1.7232 3.4205 1.2550 1.2848 2.1580 1.2038 2.1082 1.7421 1.4529 1.4410 1.3379 1.3757 1.8304 3.0966 1.3501 6.0917 2.5185 1.9134 1.3083 2.4050 4.0750 2.1876 1.9999 2.5209 2.2112 2.4603 1.6223 1.6291 2.1258 2.3296 2.1956 4.0089 2.5944 1.0645 1.0525 1.1521 1.1150 2.4256 1.8519 1.7415 2.2121 1.3086 1.2918 2.7402 1.2383 1.0950 1.2391 1.2643 1.3305 1.3578 1.4748 1.4105 1.4118 1.4405 8.8855 4.7546 1.2712 1.2150 2.6568 2.2206 2.3702 1.1405 1.0801 1.0748 1.0806 1.2367 1.2852 1.1315 1.0534 1.2587 1.0814 1.1345 2.1893 3.0226 3.8055 6.4520 6.0978 4.8383 5.0723 3.6592 1.0685 1.0590 1.0376 1.0569 1.0421 1.0615 1.0621 1.0919 1.0965 1.0697 1.1007 1.0988 1.1012 1.1004 1.0989 1.0996 1.1025 1.0887 1.0866 1.0851 1.0878 1.0891 1.0941 1.0946 1.1000 1.0996 1.0960 1.0948 1.0821
irintensity: 0.3598 0.2147 0.7055 0.2166 0.3950 0.2839 0.7561 0.3039 0.4145 0.9648 0.1373 1.5206 1.9988 1.5091 0.2222 2.9353 1.1519 3.3335 6.0561 3.3525 0.1409 2.7779 1.2466 4.9207 5.0527 1.0672 2.9207 4.9223 2.4780 6.4476 0.4684 1.5953 9.1309 6.1606 8.3993 15.9849 10.3958 24.0636 40.0202 3.2395 0.4317 20.5142 2.3700 14.8946 29.7540 38.9370 9.9527 4.9156 26.2861 51.5655 46.7757 2.0179 6.5489 4.6364 3.2720 0.5540 18.7533 2.2802 95.9775 14.2110 6.9325 3.2629 38.3150 1.4555 9.8854 5.2348 10.3882 0.3669 0.1909 0.2614 0.7661 2.7207 3.7483 8.0165 18.9016 1.4302 5.3691 8.3438 3.3902 16.8472 40.4246 2.6335 13.3992 39.0518 400.3602 34.4811 1.7259 0.0705 4.7055 1.6839 10.4506 206.5012 19.6722 50.2136 73.9340 4.8927 6.4311 62.2812 5.6442 60.3791 1.7223 11.2266 21.0367 13.0651 20.2747 8.2032 5.5733 4.7622 42.8280 21.4977 12.8636 129.9745 4.7421 89.4887 60.0006 13.5204 10.9985 2.0290 23.0285 47.1238 11.7003 0.7690 125.6367 13.7124 29.0429 22.1407 1046.7980 108.4125 4.8274 9.3580 252.4290 10.2087 195.2430 13.6464 21.7579 39.3184 40.4167 9.3621 64.5079 58.6490 16.8626 3.5606 36.9423 7.8095 19.6333 73.6086 54.9865 39.8950 54.3014 26.8485 5.9532 8.5515 1.0956 2.4352 7.3816 32.2166 25.6586 36.7574 21.8894 1.2334 7.0344 414.1155
temp: 298.150 k
press: 1.00000 atm
elementType: 8 8 7 7 7 6 6 6 6 6 6 6 6 6 6 6 6 6 6 6 6 6 6 6 6 6 6 1 1 1 1 1 1 1 1 1 1 1 1 1 1 1 1 1 1 1 1 1 1 1 1 1 1 1 1 1
symmnumber: 1
zpe: 1234419.6 jmol-1
zpe.correction: 0.470166 hartree
zpe.thermalcorrener: 0.497534 hartree
zpe.thermalcorrenthalpy: 0.498478 hartree
zpe.thermalcorrgfe: 0.408990 hartree
zpe.sumelectzpe: -1168.467270 hartree
zpe.sumelectthermal: -1168.439901 hartree
zpe.sumelectthermalent: -1168.438957 hartree
zpe.sumelectthermalfe: -1168.528445 hartree
dipole: -4.9092 1.7573 -0.5815
dipole: 5.2465
quadrupole: -153.6897 -156.1306 -160.1601
quadrupole: 7.4868 -0.0601 1.2185
quadrupole: 2.9705 0.5295 -3.5000 7.4868 -0.0601 1.2185
hfenergy: -1168.9374353 hartree
pointgroup: C01 [X(C22H29N3O2)]
dipole: 0.5329951 1.9607204 0.3635999 debye
polarizability: 321.1461528|44.5405108|287.8819374|51.2425034|-14.3703067|212.5998024 unknown
InChI: InChI=1S/C22H29N3O2/c1-3-5-17-24(18-6-4-2)22(27)25(20-15-11-8-12-16-20)21(26)23-19-13-9-7-10-14-19/h7-16,23H,3-6,17-18H2,1-2H3
charge 0 multiplicity 1
56 atoms
O  -1.076445 0.348114 -1.554968
O  -0.079762 -2.872342 1.009277
N  -0.055841 1.689916 0.045426
N  0.240058 -0.706652 0.116051
N  -1.572518 -2.072066 -0.627127
C  0.275982 1.887204 1.486719
C  -0.552628 2.872685 -0.708525
C  1.223986 3.073183 1.769675
C  -1.982229 3.303159 -0.306567
C  2.601793 2.978932 1.079676
C  -2.473068 4.51178 -1.135377
C  -0.32989 0.454583 -0.514779
C  3.491536 4.203632 1.379566
C  -3.898208 4.958463 -0.744411
C  1.660781 -0.726528 0.428256
C  -0.480446 -1.980008 0.210407
C  2.136539 -1.196948 1.676068
C  2.575668 -0.306029 -0.568569
C  3.527491 -1.239875 1.91911
C  3.962706 -0.33868 -0.311575
C  -2.537105 -3.114994 -0.677782
C  4.444426 -0.807303 0.933313
C  -3.59548 -2.954848 -1.614986
C  -2.492965 -4.277719 0.138001
C  -4.595831 -3.939484 -1.734291
C  -3.506743 -5.252249 0.009033
C  -4.560271 -5.096531 -0.920504
H  -0.672729 2.042517 2.042625
H  0.728228 0.961555 1.869138
H  0.157079 3.705477 -0.553333
H  -0.543742 2.608358 -1.778949
H  1.365608 3.109936 2.869062
H  0.735302 4.031105 1.499298
H  -2.014757 3.563777 0.770836
H  -2.665275 2.445955 -0.458671
H  2.459458 2.876917 -0.014369
H  3.114454 2.0537 1.406114
H  -2.450377 4.247246 -2.211826
H  -1.770373 5.36084 -1.005886
H  3.673357 4.308015 2.466165
H  4.47425 4.117308 0.881221
H  3.016566 5.139969 1.028825
H  -3.943506 5.25932 0.319295
H  -4.232344 5.818484 -1.353007
H  -4.624058 4.137212 -0.891945
H  1.42516 -1.54891 2.426196
H  2.199358 0.028225 -1.541773
H  -1.663517 -1.289547 -1.304889
H  3.8933 -1.615289 2.881114
H  4.66499 -0.014568 -1.087423
H  5.521728 -0.843557 1.128721
H  -3.629275 -2.057215 -2.244778
H  -1.671916 -4.405052 0.845661
H  -5.403875 -3.801946 -2.46161
H  -3.465593 -6.146265 0.641908
H  -5.337943 -5.862363 -1.012134
