program: Gaussian 09
title: 000256831
version: EM64L-G09RevD.01
frameworkgroup: C1[X(C8H10N4O3)]
method: RPBEPBE
basis: SDD
operation: Freq
keyword: #p
keyword: freq=noraman
keyword: PBEPBE/SDD
title: #p freq=noraman PBEPBE/SDD
converged: YES YES NO NO
title: Mulliken charges:
elementType: O O O N N N N C C C C C C C C H H H H H H H H H H
charge: -0.228907 -0.439822 -0.230569 -0.427530 -0.364519 -0.039095 0.012592 0.436267 0.178231 -0.432204 -0.778616 0.011863 0.055208 -0.780182 0.128651 0.374010 0.253706 0.245653 0.253473 0.245422 0.347761 0.241496 0.303065 0.242161 0.391887
chargesum: 0.00000
title: Mulliken charges with hydrogens summed into heavy atoms:
elementType: O O O N N N N C C C C C C C C
charge: -0.228907 -0.047936 -0.230569 -0.053521 -0.016758 -0.039095 0.012592 0.436267 0.178231 -0.178499 -0.034068 0.011863 0.055208 0.006540 0.128651
polarizability: 2.40011773e+02 1.72170215e+01 1.38713910e+02 2.89720823e-02 1.04725169e-03 6.09579284e+01
1716.lowfreq: -2.0971 -0.0006 0.0003 0.0004 4.6032 4.9101 47.9542 50.7909 61.6780
frequency: 47.9529 50.7873 61.6695 85.2723 117.0114 150.6680 165.4970 185.3932 188.5356 209.9640 230.6613 292.5333 312.0158 328.3640 426.0958 475.9940 488.5397 501.4286 543.7294 554.4302 557.2437 596.2918 607.0328 649.2391 677.9073 680.6940 716.4218 742.5527 760.0287 802.7793 867.6580 869.5964 954.7879 997.4282 1009.0815 1018.2584 1034.7133 1053.5396 1056.1859 1129.7453 1175.6143 1194.4451 1218.8806 1273.0576 1330.8883 1374.3749 1399.4624 1406.6257 1421.8323 1456.8129 1466.3309 1473.1619 1486.5439 1487.4974 1554.5063 1565.5692 1622.0600 1652.4999 1654.1791 2965.0025 2983.1664 3034.1337 3059.5314 3119.2090 3144.0796 3190.1846 3445.7781 3465.5769 3534.6469
redmass: 6.6213 7.9534 6.1355 4.1189 1.3511 2.4441 1.1506 4.1911 5.4791 4.0714 5.1641 5.2356 3.3464 4.6803 7.0465 2.6107 6.7476 5.7070 6.5421 4.0648 5.4734 1.1966 4.7565 1.7174 3.1241 5.2069 4.8570 5.2186 1.1573 3.6070 6.2232 1.4573 2.4998 2.3653 3.8018 2.3490 1.4988 1.5319 2.1682 5.1321 3.2813 1.8986 1.7643 1.8414 2.9991 2.5154 1.2377 1.3161 2.1006 1.5214 1.0430 1.3151 1.0459 1.7259 5.3510 7.8851 6.5559 8.3264 6.7847 1.0416 1.0391 1.0973 1.0979 1.0973 1.0937 1.0934 1.0765 1.0783 1.0643
irintensity: 7.8467 1.8826 6.8235 0.6630 0.0073 0.8950 1.4341 1.2442 6.5263 0.1566 0.4178 5.7413 9.3561 1.5242 14.0231 3.8650 4.8168 2.9215 6.2202 1.5159 10.7832 174.8060 5.7507 34.4326 8.6873 23.1460 77.9762 10.4217 77.0531 19.9908 70.8320 32.3715 22.9991 53.3330 18.1938 609.7540 2.0612 10.6601 27.8338 26.5231 178.4026 56.1181 6.4439 118.8228 171.2370 17.7521 33.6453 37.7298 13.9225 188.9877 17.8736 3.8298 22.3256 210.4195 991.4424 26.0102 46.2348 186.3369 334.0379 10.5106 14.6283 14.5884 12.8841 10.5696 0.1819 2.9721 24.4345 113.5180 69.6502
temp: 298.150 k
press: 1.00000 atm
elementType: 8 8 8 7 7 7 7 6 6 6 6 6 6 6 6 1 1 1 1 1 1 1 1 1 1
symmnumber: 1
zpe: 486601.3 jmol-1
zpe.correction: 0.185337 hartree
zpe.thermalcorrener: 0.199968 hartree
zpe.thermalcorrenthalpy: 0.200913 hartree
zpe.thermalcorrgfe: 0.142879 hartree
zpe.sumelectzpe: -754.413104 hartree
zpe.sumelectthermal: -754.398473 hartree
zpe.sumelectthermalent: -754.397528 hartree
zpe.sumelectthermalfe: -754.455562 hartree
dipole: 5.8747 3.2506 0.0113
dipole: 6.7140
quadrupole: -96.2757 -88.6044 -87.4954
quadrupole: -28.0295 -0.0354 -0.0152
quadrupole: -5.4839 2.1875 3.2964 -28.0295 -0.0354 -0.0152
hfenergy: -754.5984411 hartree
pointgroup: C01 [X(C8H10N4O3)]
dipole: 1.7443426 0.1649884 -1.9767616 debye
dipolederiv: -0.8448148 -0.0385792 0.4162684 -0.0422488 -0.385228 0.0510653 0.4869156 0.0540292 -1.1140354 -1.6372927 -0.060324 0.2298436 -0.061573 -0.4312625 0.0050526 0.2579012 0.0060777 -0.3189389 -0.5715226 -0.0056551 -0.1199025 -0.018443 -0.3138806 0.0302515 0.1761603 0.0428217 -1.1285288 -1.2336534 -0.0509014 0.1479857 -0.0248917 -0.2026558 0.0308631 -0.4520733 0.0048908 -0.7424608 -1.5124757 -0.0687959 0.4203857 -0.1009684 -0.323151 0.0277391 1.1606353 0.0591836 -0.5594858 -1.6161794 -0.0852403 0.6324582 -0.0813517 -0.285448 0.0469097 0.5195142 0.0412437 -0.7097452 0.7013023 0.0636351 -0.7311462 0.0900787 -0.0694697 -0.0480126 -1.3316133 -0.073111 0.3348671 0.9248062 0.0501968 -0.2373854 0.0347016 0.0156208 -0.039746 0.1061744 -0.0240383 0.636452 2.2306005 0.1088189 -0.5149863 0.0854999 0.2085806 -0.0553505 0.0263282 -0.0326724 0.9598957 -0.2204602 0.0020028 -0.0737705 -0.0040459 -0.1947073 0.0231545 0.0519754 0.0287096 -0.7752689 -0.0258407 -0.0036161 -0.0115831 0.0023251 0.0682517 0.0109365 -0.1354123 0.0043819 -0.1527911 1.6639704 0.0876353 -0.5739995 0.0871118 0.2370135 -0.0795322 -0.5200385 -0.0767259 1.4304223 -0.7451844 -0.0624034 0.7428322 -0.069212 -0.0295731 0.0383398 0.9299694 0.0466314 -0.2017379 -0.0965561 -0.0057466 -0.0529916 -0.0034496 0.1117326 0.0093318 -0.1552434 0.0046265 -0.1518476 1.8938072 0.0828244 -0.2927273 0.1134812 0.2206563 -0.0735443 -1.0128713 -0.1039577 1.6392978 0.4308549 0.0058501 -0.020792 0.0049735 0.3096545 0.003559 0.0009866 0.0045628 0.2033903 -0.063575 -0.0081623 -0.0394228 -0.0076505 0.1669415 0.0018816 -0.0516034 0.0012461 0.0890569 0.0881032 -0.0767651 0.0206433 -0.0414629 -0.037109 0.102852 -0.0091069 0.0637189 0.0155495 -0.1002017 -0.0090991 -0.0307492 -0.0134816 0.1245946 0.0000081 0.0675876 0.0046743 0.0913398 0.0761543 0.0841065 0.0380049 0.0515477 -0.0094656 -0.1034788 0.0014619 -0.0670481 0.0001505 0.0965688 -0.0115236 0.0376144 -0.0081996 0.3304341 0.0101495 -0.0434084 0.0063329 0.1423803 0.0794436 -0.0765532 0.036664 -0.0026608 -0.0361169 0.0877531 -0.0547295 0.0737195 0.0223946 -0.0097481 -0.0056882 0.0129605 -0.0074587 0.1370332 -0.0007743 0.0639279 0.0011353 0.1592523 0.0730733 0.0797002 0.0487411 0.0150707 -0.0166063 -0.0879949 -0.0493327 -0.0811906 0.0099546 0.41882 0.0042833 -0.0849456 0.0023081 0.4041604 0.0085864 -0.0341049 0.010758 0.1204369 unknown
polarizability: 217.3482465|8.5975142|61.5993327|-45.0433369|-6.3037032|160.736032 unknown
InChI: InChI=1S/C8H10N4O3/c1-4-3-6(13)10-8(9-4)12-11-5(2)7(14)15/h3,9,12,14H,1-2H3
charge 0 multiplicity 1
25 atoms
O  -3.647599 0.336984 3.342473
O  4.346992 0.891676 -1.566557
O  2.284485 0.852635 -2.644555
N  -1.568702 0.584947 -0.171826
N  0.444493 0.617617 1.059007
N  -1.573869 0.47828 2.237116
N  1.076181 0.695047 -0.141403
C  -2.968393 0.527646 -0.249273
C  -0.964188 0.556196 1.07313
C  -3.679446 0.444241 0.928384
C  -3.562809 0.564845 -1.633898
C  -3.015137 0.413976 2.251044
C  2.399702 0.75156 -0.189198
C  3.297996 0.735657 1.027001
C  2.938478 0.833719 -1.576235
H  -0.956051 0.647785 -0.994517
H  -4.770524 0.398069 0.913329
H  -3.288315 1.497151 -2.16269
H  -4.660613 0.511158 -1.58028
H  -3.20522 -0.284193 -2.246583
H  0.906258 0.59779 1.978045
H  3.151894 -0.18942 1.620429
H  4.352334 0.785347 0.726625
H  3.087998 1.598174 1.691268
H  4.666655 0.945315 -2.506931
