program: Gaussian 09
title: 000256828
version: EM64L-G09RevD.01
frameworkgroup: C1[X(C7H11NO)]
method: RPBEPBE
basis: SDD
operation: Freq
keyword: #p
keyword: freq=noraman
keyword: PBEPBE/SDD
title: #p freq=noraman PBEPBE/SDD
converged: YES YES NO NO
title: Mulliken charges:
elementType: O N C C C C C C C H H H H H H H H H H H
charge: -0.444182 -0.064672 -0.144739 -0.263096 -0.488898 -0.457047 -0.463315 -0.509063 0.117549 0.234588 0.265290 0.224689 0.237828 0.213216 0.226267 0.234419 0.231433 0.252187 0.236492 0.361054
chargesum: 0.00000
title: Mulliken charges with hydrogens summed into heavy atoms:
elementType: O N C C C C C C C
charge: -0.083129 -0.064672 0.089849 0.002194 -0.026380 -0.017565 0.002537 -0.020384 0.117549
polarizability: 1.03027143e+02 -8.51897034e-01 7.44159737e+01 -2.45894638e+00 -1.07611569e+00 6.63121266e+01
1716.lowfreq: -14.1212 0.0009 0.0009 0.0011 11.2198 23.2606 91.3575 185.5690 216.6403
frequency: 91.3407 185.5448 216.6333 307.5061 367.7958 396.9410 432.1595 469.9532 542.4274 568.0584 712.2460 761.5506 801.0678 813.3738 831.2001 860.3333 885.2586 913.4689 922.5658 951.7242 957.1925 963.8589 1035.7694 1046.4658 1079.7097 1105.0519 1121.7321 1151.8393 1187.6888 1202.1962 1223.4800 1240.0705 1256.6968 1263.9222 1284.1318 1296.4995 1307.7163 1326.8415 1442.7743 1468.7912 1469.7473 1489.7783 1649.3410 2996.3280 3000.7012 3011.6183 3015.7418 3055.9122 3059.8075 3074.3486 3081.5016 3087.2584 3102.8864 3563.3069
redmass: 3.3193 2.7341 3.6210 2.9531 2.8779 1.4053 1.6359 2.7004 3.1061 3.7290 4.2155 3.7660 1.9147 2.4402 2.9811 2.9050 2.9746 2.5310 1.8087 2.0588 1.9068 1.7986 1.5543 1.6413 1.2583 1.1086 1.3491 1.5338 1.7484 1.5054 1.3985 1.6282 1.3632 1.4020 1.5007 1.6212 1.4964 1.7880 1.0828 1.0921 1.0796 1.0984 9.3237 1.0625 1.0594 1.0596 1.0629 1.1018 1.1015 1.0904 1.1056 1.1056 1.0911 1.0674
irintensity: 0.0970 0.2263 0.4864 8.5564 2.8416 86.4485 50.7874 9.3600 6.5978 2.9907 3.9205 3.0554 0.0990 41.8594 45.3660 38.2080 31.5060 0.1497 4.7868 0.5843 10.0318 3.8398 0.9224 0.8702 14.0209 0.4372 1.7395 7.3366 10.8249 5.6054 2.4521 11.5167 18.8684 6.0568 4.0731 4.8843 2.2424 19.9875 16.4072 13.8852 5.5063 2.7349 5.3647 13.6933 30.0202 49.0004 46.2898 6.2401 12.8533 53.3640 27.6890 63.4008 19.0993 31.8036
temp: 298.150 k
press: 1.00000 atm
elementType: 8 7 6 6 6 6 6 6 6 1 1 1 1 1 1 1 1 1 1 1
symmnumber: 1
zpe: 446517.3 jmol-1
zpe.correction: 0.170069 hartree
zpe.thermalcorrener: 0.177825 hartree
zpe.thermalcorrenthalpy: 0.178770 hartree
zpe.thermalcorrgfe: 0.137994 hartree
zpe.sumelectzpe: -402.562401 hartree
zpe.sumelectthermal: -402.554645 hartree
zpe.sumelectthermalent: -402.553701 hartree
zpe.sumelectthermalfe: -402.594477 hartree
dipole: -1.3711 0.3177 0.0528
dipole: 1.4085
quadrupole: -49.5504 -54.8467 -53.9551
quadrupole: -0.2200 -0.8822 0.5394
quadrupole: 3.2337 -2.0626 -1.1710 -0.2200 -0.8822 0.5394
hfenergy: -402.7324704 hartree
pointgroup: C01 [X(C7H11N1O1)]
dipole: 0.5398051 0.1220328 -0.0279736 debye
dipolederiv: -0.9240081 0.2103261 0.1174913 0.8518298 -0.2738507 -0.0929097 0.3051935 -0.0068429 -0.431187 0.418776 -0.1677074 -0.1516934 -0.7289385 -0.1558344 0.1166883 -0.2817359 0.0461824 -0.1491881 0.1359316 0.0441205 -0.0052874 0.0326513 0.1303804 -0.0209982 -0.0144151 -0.0323224 0.0652373 -0.0320139 0.0119644 0.0185548 -0.0482539 0.0784942 0.0433583 -0.0848985 0.0289061 0.079183 0.0603963 -0.0398346 0.025312 0.0345976 -0.0230553 -0.0456874 0.0216072 -0.0173047 0.0121362 0.1197312 0.0200136 -0.0423486 0.0096923 -0.0181741 0.0324062 -0.0291148 0.0482792 0.0515928 0.0301895 -0.0432164 -0.0473143 0.040046 0.0490191 0.0027786 0.0346851 -0.0210161 0.0474955 0.0314139 -0.0439657 0.0090111 -0.059483 -0.1691481 -0.0539218 0.0460299 -0.0624061 0.1484016 0.1969392 0.042252 0.0047301 -0.0236411 0.2717152 0.0675324 -0.0177432 0.0705072 -0.0596885 -0.0139744 -0.0945801 0.010266 -0.10535 -0.147668 0.0360248 0.0101154 0.0362653 0.0594995 0.0460072 -0.0553288 -0.0333493 -0.0277654 -0.0889284 -0.0857994 -0.0099421 -0.0783149 0.0241325 -0.1716104 0.0638515 0.0985988 0.0549238 0.0454024 -0.0293634 0.0437138 -0.0151489 0.0619365 0.0455013 0.0326401 -0.1187703 0.0268882 0.0401412 0.080816 -0.0692461 0.0607075 -0.1216149 0.0626702 0.0295049 0.081146 -0.0027534 0.0183507 -0.0760294 0.0194853 -0.0807304 -0.1444066 -0.2111467 -0.0297164 -0.0443303 -0.0019685 0.0464813 -0.0070461 0.0066682 0.0019495 0.0681936 -0.1213444 0.1415812 0.0060345 0.0999423 -0.0512054 -0.0126345 -0.0059779 -0.0390675 0.0643465 0.0363999 -0.0742426 0.0864478 -0.0398906 0.0110615 0.0577561 0.0680268 0.0876133 -0.0726075 0.0149311 0.0513087 -0.0647618 0.0041688 0.0051721 0.0575282 -0.0743474 0.1041298 0.0017982 0.0274369 -0.0007258 0.0503289 -0.0114126 0.062935 -0.0355707 0.0385446 -0.0938711 -0.0753058 0.2477735 -0.0982453 -0.0000661 -0.1052831 0.1687114 -0.0349283 -0.0066489 -0.037515 0.3700451 unknown
polarizability: 102.9801896|0.6869904|74.4358401|-2.841326|0.9727776|66.3392131 unknown
InChI: InChI=1S/C7H11NO/c9-8-7-4-5-1-2-6(7)3-5/h5-6,9H,1-4H2
charge 0 multiplicity 1
20 atoms
O  -2.960131 0.315418 0.359204
N  -1.983223 -0.723456 -0.069967
C  1.19775 1.126478 -0.138872
C  0.43584 -0.997538 -0.551501
C  1.250045 0.098325 -1.311772
C  1.810043 0.296213 1.033639
C  1.301907 -1.16657 0.745515
C  -0.338409 1.24724 0.097239
C  -0.793209 -0.190419 -0.151866
H  1.69787 2.091668 -0.316599
H  0.213998 -1.935692 -1.07955
H  2.275372 -0.231104 -1.557054
H  0.751169 0.455651 -2.229741
H  1.475297 0.671551 2.017097
H  2.913635 0.346192 1.016173
H  2.144232 -1.852679 0.542573
H  0.714059 -1.589363 1.577515
H  -0.823021 1.928899 -0.62842
H  -0.615474 1.601302 1.106361
H  -3.807748 -0.199617 0.368327
