program: Gaussian 09
title: 000256824
version: EM64L-G09RevD.01
frameworkgroup: C1[X(C9H17ClO2)]
method: RPBEPBE
basis: SDD
operation: Freq
keyword: #p
keyword: freq=noraman
keyword: PBEPBE/SDD
title: #p freq=noraman PBEPBE/SDD
converged: YES YES NO NO
title: Mulliken charges:
elementType: Cl O O C C C C C C C C C H H H H H H H H H H H H H H H H H
charge: -0.080881 -0.276869 -0.246424 -0.369813 -0.358548 -0.520847 -0.316556 0.038390 0.246417 -0.601049 -0.683940 -0.685451 0.212520 0.227086 0.191610 0.193359 0.239702 0.245998 0.222418 0.223687 0.231990 0.258892 0.259093 0.213738 0.252886 0.219055 0.208705 0.231637 0.223193
chargesum: 0.00000
title: Mulliken charges with hydrogens summed into heavy atoms:
elementType: Cl O O C C C C C C C C C
charge: -0.080881 -0.276869 -0.246424 0.069794 0.026421 -0.035147 0.129550 0.270380 0.246417 -0.083063 0.001739 -0.021916
polarizability: 1.58775500e+02 -6.81673545e+00 9.76948109e+01 3.33602893e+00 -3.89280347e+00 8.78118976e+01
1716.lowfreq: -25.7900 -5.2020 0.0016 0.0019 0.0021 3.3988 19.6769 29.5541 43.2039
frequency: -14.5039 27.6138 42.9949 57.7607 69.9178 94.2498 115.4216 127.5001 137.7009 178.8858 198.8168 211.7306 248.1283 288.4120 354.3313 379.6523 395.5524 432.6807 487.3551 558.3374 665.2962 690.4096 727.6878 758.1288 772.7745 820.6928 877.2476 919.6144 927.7476 930.9053 944.0566 1018.0895 1031.7088 1059.0693 1076.4083 1089.1683 1097.0685 1110.1070 1140.5058 1159.2926 1184.5726 1216.1164 1224.4780 1263.9979 1270.5929 1287.0260 1290.1482 1311.9533 1326.3068 1337.4005 1349.6756 1364.4941 1381.0219 1395.8236 1440.8548 1456.4231 1457.8964 1465.9235 1467.0994 1472.4507 1473.5423 1486.4874 1487.9192 1634.4500 2957.1974 2981.4039 2989.0138 2992.3961 2994.9035 2999.5383 3003.3671 3026.3900 3037.1064 3045.7522 3056.1062 3068.1722 3084.1088 3092.7736 3097.9530 3103.7903 3127.9265
redmass: 2.4404 3.2313 5.1272 3.5064 4.1008 2.1330 3.4306 3.5424 2.2195 6.2230 1.0530 2.4124 1.3349 3.6568 3.1730 4.2819 3.2862 2.7099 2.9453 2.8673 6.8302 5.1495 1.1180 1.1609 3.5153 1.3153 3.5063 3.5076 1.2337 1.3387 1.3986 4.7989 3.9884 1.2439 2.1572 3.8313 2.0133 1.3820 2.4194 2.0356 1.9082 1.4147 1.2703 1.2281 1.2598 1.0616 1.1210 1.3206 1.4631 1.3581 1.5177 1.7080 1.2583 1.2303 1.0860 1.0986 1.0525 1.0469 1.0681 1.0909 1.0499 1.0988 1.0480 9.7410 1.0587 1.0638 1.0356 1.0359 1.0616 1.0634 1.0950 1.0864 1.0968 1.0563 1.1032 1.1028 1.0994 1.0987 1.1006 1.1006 1.1113
irintensity: 0.4320 0.0252 0.3663 1.8390 1.1953 0.3115 2.0968 1.4244 2.5051 0.5209 0.3459 9.8957 4.2400 0.4401 1.3535 16.2989 2.6891 4.8983 1.3561 2.1534 26.4329 15.3467 14.1200 1.4129 6.2548 4.4121 4.7146 34.9007 2.5278 0.9541 0.8108 53.2996 18.9149 2.1674 13.0098 10.2155 229.0480 6.2384 178.2298 13.7979 4.8751 1.0176 43.5991 28.0234 50.7891 0.0370 3.9745 5.9917 4.5676 6.6962 22.6686 18.8634 33.8210 15.8194 22.6699 2.5182 6.4108 4.9655 0.1280 0.5805 4.9832 18.8160 23.8994 157.9993 24.6718 5.9709 15.7294 23.8908 5.9953 36.3805 18.0230 7.0236 0.6184 30.3204 1.4877 68.9756 4.9790 53.8403 22.3615 31.6239 28.5431
temp: 298.150 k
press: 1.00000 atm
elementType: 17 8 8 6 6 6 6 6 6 6 6 6 1 1 1 1 1 1 1 1 1 1 1 1 1 1 1 1 1
symmnumber: 1
zpe: 645550.3 jmol-1
zpe.correction: 0.245877 hartree
zpe.thermalcorrener: 0.260477 hartree
zpe.thermalcorrenthalpy: 0.261421 hartree
zpe.thermalcorrgfe: 0.202070 hartree
zpe.sumelectzpe: -962.696495 hartree
zpe.sumelectthermal: -962.681895 hartree
zpe.sumelectthermalent: -962.680951 hartree
zpe.sumelectthermalfe: -962.740302 hartree
dipole: 3.4012 -2.3198 1.2750
dipole: 4.3099
quadrupole: -90.9369 -84.4532 -79.3955
quadrupole: 3.0677 -2.9943 2.2056
quadrupole: -6.0084 0.4753 5.5330 3.0677 -2.9943 2.2056
hfenergy: -962.9423725 hartree
pointgroup: C01 [X(C9H17Cl1O2)]
dipole: -1.3185912 1.0144494 0.3276779 debye
polarizability: 158.2616511|-7.4310233|99.0041535|-6.1719248|1.287222|87.0164036 unknown
InChI: InChI=1S/C9H17ClO2/c1-8(2)12-9(11)6-4-3-5-7-10/h8H,3-7H2,1-2H3
charge 0 multiplicity 1
29 atoms
Cl 6.524571 -0.31125 -0.476886
O  -2.52349 0.544334 0.156751
O  -1.436253 -1.517935 0.008435
C  1.150575 -0.207493 -0.126244
C  2.430229 0.621944 0.120053
C  -0.127623 0.572942 0.238334
C  3.711791 -0.16348 -0.257974
C  -3.867492 -0.146098 0.108487
C  -1.38938 -0.26979 0.117931
C  4.969893 0.664788 -0.000688
C  -4.221879 -0.638303 1.518897
C  -4.836292 0.897835 -0.450253
H  1.103892 -0.51616 -1.188545
H  1.185655 -1.142881 0.462927
H  2.477319 0.918581 1.188848
H  2.384257 1.563057 -0.46673
H  -0.070834 0.935945 1.285164
H  -0.246234 1.477011 -0.387349
H  3.67235 -0.451484 -1.325656
H  3.761431 -1.100987 0.327509
H  -3.760904 -1.007993 -0.576422
H  5.008474 1.579036 -0.613389
H  5.103744 0.913043 1.063788
H  -5.214708 -1.124492 1.509575
H  -3.48272 -1.375956 1.873574
H  -4.256687 0.208308 2.227446
H  -5.847774 0.461907 -0.540439
H  -4.513339 1.240258 -1.448181
H  -4.893077 1.774912 0.218236
