program: Gaussian 09
title: 000256822
version: EM64L-G09RevD.01
frameworkgroup: C1[X(C11H24O)]
method: RPBEPBE
basis: SDD
operation: Freq
keyword: #pfreq=noraman
keyword: PBEPBE/SDD
title: #p freq=noraman PBEPBE/SDD
converged: YES YES NO NO
title: Mulliken charges:
elementType: O C C C C C C C C C C C H H H H H H H H H H H H H H H H H H H H H H H H
charge: -0.435846 0.447054 -0.512918 -0.455888 -0.416406 -0.460439 -0.399586 -0.390949 -0.739588 -0.346347 -0.695906 -0.699093 0.202081 0.208926 0.187192 0.197604 0.194760 0.223250 0.216560 0.194901 0.208115 0.196706 0.214892 0.206645 0.217801 0.221024 0.216462 0.192184 0.197163 0.209926 0.216806 0.208073 0.336573 0.210667 0.209426 0.218173
chargesum: 0.00000
title: Mulliken charges with hydrogens summed into heavy atoms:
elementType: O C C C C C C C C C C C
charge: -0.099273 0.447054 -0.101911 -0.071093 0.001604 -0.048977 0.005236 0.030588 -0.084301 0.043000 -0.061100 -0.060826
polarizability: 1.38011307e+02 5.18041003e-01 1.23334830e+02 -5.64429635e-01 -1.50976911e+00 1.06120904e+02
1716.lowfreq: -18.0548 -9.6473 -7.3769 -0.0002 0.0004 0.0008 38.1699 46.1952 66.0856
frequency: 36.7982 45.5059 65.8273 81.3301 83.4706 100.0546 126.3209 140.3124 172.2832 225.1114 229.6087 233.7217 255.7636 275.9040 283.8635 297.9575 326.3651 331.1697 332.3847 373.4567 452.1958 524.3541 574.3849 724.7287 730.3197 748.0200 769.4360 784.2718 843.1578 868.7202 880.8514 895.5363 917.3356 961.1068 983.3911 991.7006 1004.5952 1036.2871 1049.1689 1057.4516 1075.1823 1082.9294 1093.0096 1105.6539 1134.3057 1179.4456 1195.6988 1205.9721 1221.4878 1244.0753 1271.3561 1273.8537 1282.7863 1290.4060 1296.5195 1314.3825 1326.0063 1338.0275 1347.7055 1356.6055 1358.6691 1375.4577 1387.0229 1390.3544 1392.1164 1457.8280 1466.4700 1467.4023 1470.9633 1473.0139 1476.9093 1477.2975 1477.5691 1482.8981 1485.1825 1488.6699 1492.4812 1493.6470 2952.7507 2955.0124 2957.8271 2961.7473 2967.9680 2970.6105 2972.3376 2972.6924 2976.0986 2979.4844 2995.3816 2998.9097 3010.4632 3023.5872 3027.1813 3035.1406 3067.1309 3067.7201 3068.8210 3070.4676 3071.2126 3072.1392 3075.3077 3565.2909
redmass: 3.0413 1.8383 1.5985 3.2697 2.3738 2.9640 2.4233 3.1696 1.5376 1.4914 1.2047 1.3591 1.5268 2.6073 1.7620 1.6566 3.0477 2.2042 2.2501 3.1822 2.8806 2.2429 2.4841 1.2246 1.1057 2.4071 1.1638 1.3778 1.7051 1.6388 1.6920 1.7826 1.4407 2.2700 1.7473 2.1101 2.0353 1.9751 2.7462 2.2913 1.5119 2.0546 2.1227 2.2622 1.4299 2.1000 2.3380 2.1000 1.4149 1.3256 1.2368 1.2765 1.2284 1.1156 1.1401 1.3162 1.2816 1.4465 1.4396 1.5455 1.5073 1.2317 1.2126 1.2176 1.2095 1.0675 1.0748 1.0682 1.0624 1.0661 1.0567 1.0531 1.0463 1.0604 1.0672 1.0517 1.0693 1.0894 1.0657 1.0598 1.0624 1.0615 1.0612 1.0368 1.0555 1.0391 1.0618 1.0377 1.0944 1.0946 1.0986 1.1003 1.1021 1.1021 1.0981 1.0992 1.1006 1.0974 1.0989 1.0993 1.0989 1.0661
irintensity: 0.2238 0.0123 0.2759 2.5708 0.1219 0.0856 0.6155 0.5480 0.8663 4.8197 0.0165 3.7048 29.9337 15.6806 28.0568 46.7430 7.3250 0.6773 13.2581 1.1704 0.5905 8.1645 1.7900 7.5470 7.8549 5.2630 6.6489 4.8826 0.8343 0.2212 24.8201 8.3913 9.4228 35.7373 35.1466 10.5754 6.8846 3.3661 0.4979 2.6764 5.8331 4.4084 11.3354 10.2747 13.9374 0.4431 3.0091 10.8434 1.0912 1.0974 1.8789 2.8147 0.1513 0.6310 2.0480 0.6742 12.3094 2.6233 1.5353 1.3688 1.0018 11.9788 11.2505 12.8765 14.5084 0.7532 2.4919 0.1675 1.1992 3.2196 11.4641 14.9616 10.3209 13.2304 2.0950 14.5024 3.2487 30.7837 8.9065 7.3608 3.9396 22.2669 71.5478 61.2772 0.4831 47.3033 92.8986 31.4279 15.6277 12.8543 4.1870 7.0702 33.6123 68.6718 3.0869 110.1485 76.1209 54.7178 53.9462 49.1551 59.2836 4.2170
temp: 298.150 k
press: 1.00000 atm
elementType: 8 6 6 6 6 6 6 6 6 6 6 6 1 1 1 1 1 1 1 1 1 1 1 1 1 1 1 1 1 1 1 1 1 1 1 1
symmnumber: 1
zpe: 863577.4 jmol-1
zpe.correction: 0.328919 hartree
zpe.thermalcorrener: 0.345392 hartree
zpe.thermalcorrenthalpy: 0.346336 hartree
zpe.thermalcorrgfe: 0.284853 hartree
zpe.sumelectzpe: -507.750816 hartree
zpe.sumelectthermal: -507.734343 hartree
zpe.sumelectthermalent: -507.733399 hartree
zpe.sumelectthermalfe: -507.794882 hartree
dipole: 1.0050 1.8409 0.3030
dipole: 2.1191
quadrupole: -76.7759 -87.1891 -79.1158
quadrupole: -3.3000 0.0492 -1.7121
quadrupole: 4.2510 -6.1622 1.9111 -3.3000 0.0492 -1.7121
hfenergy: -508.0797354 hartree
pointgroup: C01 [X(C11H24O1)]
dipole: 0.4649809 0.681387 0.1208853 debye
polarizability: 137.9707457|-0.9339308|123.3821005|-0.6898608|-1.412825|106.1141958 unknown
InChI: InChI=1S/C11H24O/c1-4-7-9-11(6-3,10-12)8-5-2/h12H,4-10H2,1-3H3
charge 0 multiplicity 1
36 atoms
O  -0.320514 -2.837143 -0.759689
C  -0.72299 -0.42643 -0.05155
C  0.657317 -0.403512 0.683458
C  -1.04461 0.94756 -0.718881
C  -1.798344 -0.836418 1.008484
C  -0.696957 -1.481927 -1.197681
C  1.910362 -0.10547 -0.173111
C  -1.132833 2.168038 0.226564
C  -3.275467 -0.755204 0.564139
C  3.208452 -0.094492 0.668541
C  -1.487168 3.464814 -0.53495
C  4.469554 0.207539 -0.169144
H  0.794277 -1.377316 1.200351
H  0.605308 0.348096 1.496089
H  -0.278542 1.161062 -1.493694
H  -2.004938 0.858538 -1.267914
H  -1.661123 -0.211058 1.91383
H  -1.574881 -1.878882 1.310869
H  -1.707482 -1.610374 -1.620744
H  -0.027275 -1.138707 -2.015083
H  1.802924 0.876995 -0.674984
H  2.022304 -0.853351 -0.98657
H  -1.892787 1.984781 1.011089
H  -0.168208 2.308584 0.753021
H  -3.581422 0.278663 0.31998
H  -3.475874 -1.387467 -0.320086
H  -3.936606 -1.112607 1.375108
H  3.324324 -1.074792 1.175052
H  3.108819 0.659594 1.475831
H  -2.464705 3.370621 -1.04473
H  -1.543672 4.332994 0.147192
H  -0.728091 3.690458 -1.307871
H  0.637035 -2.83649 -0.508305
H  4.393468 1.197453 -0.657417
H  4.608421 -0.548002 -0.965585
H  5.380928 0.209056 0.456492
