program: Gaussian 09
title: 000256816
version: EM64L-G09RevD.01
frameworkgroup: C1[X(C10H19NO)]
method: RPBEPBE
basis: SDD
operation: Freq
keyword: #p
keyword: freq=noraman
keyword: PBEPBE/SDD
title: #p freq=noraman PBEPBE/SDD
converged: YES YES NO NO
title: Mulliken charges:
elementType: O N C C C C C C C C C C H H H H H H H H H H H H H H H H H H H
charge: -0.458070 -0.076375 -0.145585 -0.192101 -0.070608 -0.506386 -0.161973 -0.478718 -0.473694 -0.472193 -0.629428 -0.612547 0.241287 0.235436 0.266501 0.222268 0.238467 0.194188 0.218565 0.225622 0.204395 0.224078 0.200775 0.207372 0.327709 0.236121 0.190255 0.215908 0.220500 0.186647 0.221585
chargesum: 0.00000
title: Mulliken charges with hydrogens summed into heavy atoms:
elementType: O N C C C C C C C C C C
charge: -0.130361 -0.076375 0.095701 0.043335 0.195893 -0.045651 0.032214 -0.034532 -0.045222 -0.064046 0.012856 0.016186
polarizability: 1.26870320e+02 -1.69001735e+00 1.08108364e+02 1.41852870e+00 7.02171990e-01 1.01093049e+02
1716.lowfreq: -21.2255 -2.4710 0.0007 0.0008 0.0008 21.7582 45.8171 61.3140 96.6932
frequency: 45.3629 61.3027 96.6460 136.5887 202.4728 229.6507 240.3380 267.3509 288.6849 317.6873 329.0773 360.7943 366.9617 402.0429 449.0496 473.9369 542.8849 627.2963 742.8890 752.0532 794.7834 807.1568 815.3661 884.0413 893.8756 915.4182 930.8846 947.4942 962.0969 972.0533 998.8257 1021.2954 1029.7269 1035.7366 1053.1741 1067.2404 1085.9123 1097.2413 1120.6755 1129.0977 1131.4829 1154.2490 1169.2518 1183.9116 1209.4059 1217.3855 1237.7359 1255.2437 1261.0994 1266.6345 1282.9166 1284.5791 1295.5562 1309.8863 1313.7152 1338.0531 1367.6396 1379.4058 1418.8277 1442.4098 1458.9918 1461.7716 1466.6368 1471.0820 1477.0176 1477.8613 1486.9274 1496.3023 2822.8023 2842.9248 2859.3382 2947.1202 2991.2659 2992.9536 3008.6701 3012.8920 3013.1637 3014.5562 3026.7313 3042.3525 3052.6193 3072.4869 3077.8288 3080.3234 3083.2049 3083.9397 3552.3981
redmass: 2.7132 3.4674 2.6988 3.0582 1.9012 1.5617 1.1082 2.7759 2.0614 1.4031 1.9316 2.9171 1.9123 2.8348 2.1302 2.7383 3.0277 3.5593 3.6635 3.3729 1.6767 3.3888 2.3678 2.4559 2.3024 2.8909 2.4353 2.1015 2.0917 1.7813 1.5900 2.1478 1.9679 1.5360 1.9690 1.6084 1.3491 1.4688 1.3044 1.1729 1.3560 1.6241 1.6618 1.9106 1.5655 1.3359 1.5107 1.5284 1.6478 1.9560 1.5004 1.5301 1.4681 1.4438 1.5087 1.3893 1.3759 1.5167 1.1466 1.1540 1.0639 1.0725 1.0936 1.0650 1.0548 1.0781 1.0572 1.0892 1.0703 1.0574 1.0577 1.0860 1.0607 1.0830 1.0600 1.0710 1.0705 1.0821 1.0719 1.0920 1.0969 1.1010 1.1008 1.0930 1.1041 1.1003 1.0657
irintensity: 0.5811 0.7622 1.3317 0.1963 0.5064 1.2625 0.3152 4.2316 9.0406 75.5580 61.1147 5.0959 2.2904 4.9065 1.8754 1.9084 5.2707 7.8522 2.4801 4.2394 0.7707 13.3495 19.2788 3.7487 1.9647 10.5241 0.5823 7.0464 25.9254 35.1587 13.0351 17.6025 21.1613 15.9921 5.2153 8.7758 3.4060 6.7389 12.8112 1.8436 10.2608 11.1547 1.4452 7.1350 24.6816 10.0407 2.3586 10.4981 5.6028 6.0023 9.1717 1.1622 9.8607 5.2136 9.8907 6.2086 4.4264 7.5354 2.8139 1.4005 10.2399 14.1756 12.7769 11.5880 9.7286 13.8630 11.8066 11.7235 58.2501 76.9304 238.8118 58.7880 48.5437 4.1780 39.5928 5.1758 49.9215 75.9841 40.3685 55.0679 37.6373 32.9672 20.8683 40.2050 64.8016 38.1389 2.8377
temp: 298.150 k
press: 1.00000 atm
elementType: 8 7 6 6 6 6 6 6 6 6 6 6 1 1 1 1 1 1 1 1 1 1 1 1 1 1 1 1 1 1 1
symmnumber: 1
zpe: 726065.8 jmol-1
zpe.correction: 0.276544 hartree
zpe.thermalcorrener: 0.288898 hartree
zpe.thermalcorrenthalpy: 0.289842 hartree
zpe.thermalcorrgfe: 0.238280 hartree
zpe.sumelectzpe: -521.422663 hartree
zpe.sumelectthermal: -521.410309 hartree
zpe.sumelectthermalent: -521.409364 hartree
zpe.sumelectthermalfe: -521.460926 hartree
dipole: -0.4484 -0.4959 -1.2095
dipole: 1.3820
quadrupole: -67.5938 -79.0108 -73.0150
quadrupole: -0.3516 2.2949 -1.0841
quadrupole: 5.6127 -5.8043 0.1916 -0.3516 2.2949 -1.0841
hfenergy: -521.6992066 hartree
pointgroup: C01 [X(C10H19N1O1)]
dipole: -0.1799885 0.1559905 0.4887594 debye
polarizability: 126.8314673|2.0224457|108.0077201|-1.2155097|1.218892|101.2325459 unknown
InChI: InChI=1S/C10H19NO/c1-11(2)6-9-7-3-4-8(5-7)10(9)12/h7-10,12H,3-6H2,1-2H3
charge 0 multiplicity 1
31 atoms
O  -1.515712 -2.414344 0.171048
N  2.434023 0.203048 -0.055095
C  -0.508459 0.717978 -0.95227
C  -2.337476 -0.018952 0.193694
C  0.022208 -0.546106 -0.198846
C  -1.96088 0.266467 -1.288808
C  -1.228832 -1.030508 0.605352
C  -0.776485 1.872715 0.055637
C  -2.002356 1.340167 0.88608
C  1.274421 -0.360781 0.6776
C  2.933191 -0.677993 -1.129189
C  3.516589 0.608888 0.863287
H  0.127203 1.014342 -1.801057
H  -3.36146 -0.382078 0.390739
H  0.212667 -1.339081 -0.947397
H  -2.571088 1.064569 -1.748796
H  -2.004404 -0.640244 -1.917685
H  -1.064894 -1.0141 1.705065
H  -1.040015 2.796265 -0.491636
H  0.10618 2.103188 0.675228
H  -1.762488 1.205494 1.958284
H  -2.860985 2.032724 0.826697
H  1.523814 -1.350379 1.147021
H  1.045919 0.33225 1.511347
H  -2.322762 -2.736599 0.648033
H  2.144396 -0.856663 -1.87932
H  3.283947 -1.673974 -0.754192
H  3.780122 -0.18698 -1.641438
H  4.325436 1.100385 0.29267
H  3.96684 -0.247838 1.428498
H  3.128044 1.334842 1.60045
