program: Gaussian 09
title: 000256813
version: EM64L-G09RevD.01
frameworkgroup: C1[X(C14H17N3)]
method: RPBEPBE
basis: SDD
operation: Freq
keyword: #pfreq=noraman
keyword: PBEPBE/SDD
title: #p freq=noraman PBEPBE/SDD
converged: NO YES NO NO
title: Mulliken charges:
elementType: N N N C C C C C C C C C C C C C C H H H H H H H H H H H H H H H H H
charge: -0.047945 -0.050748 -0.409065 -0.329132 -0.451325 -0.452729 -0.463624 -0.465079 -0.401457 0.440862 0.059665 -0.443190 0.220284 -0.398525 -0.364948 -0.258053 -0.220582 0.255715 0.257082 0.215166 0.213110 0.249592 0.235690 0.217685 0.216453 0.235793 0.207685 0.210063 0.289680 0.300946 0.272733 0.223599 0.217036 0.217565
chargesum: 0.00000
title: Mulliken charges with hydrogens summed into heavy atoms:
elementType: N N N C C C C C C C C C C C C C C
charge: -0.047945 -0.050748 -0.108119 -0.073417 0.020923 0.009973 -0.010249 -0.012833 0.016292 0.440862 0.059665 -0.153510 0.220284 -0.125791 -0.141349 -0.041017 -0.003018
polarizability: 2.12390854e+02 -1.02672796e+01 1.70197020e+02 9.13016156e+00 1.12111366e+00 1.04879192e+02
1716.lowfreq: -21.7433 -9.1864 -0.0009 -0.0007 -0.0005 5.1096 34.2082 71.9832 89.2092
frequency: 33.4580 71.7158 89.1051 169.4094 206.2609 219.4943 226.5160 243.8116 304.5524 330.3337 380.3388 411.8151 425.5425 449.9350 490.0815 511.8499 541.7878 564.5794 576.8832 612.2480 630.8826 672.3583 723.7179 751.5050 754.5969 757.2755 758.2046 790.8531 816.2592 823.8632 840.3967 855.9682 860.9572 863.1358 868.1016 884.8972 916.6569 934.9940 938.7145 971.1758 979.5832 982.9536 1008.9137 1043.6154 1060.0996 1073.0427 1086.8289 1103.9579 1129.7079 1131.7952 1163.9194 1177.6611 1185.7050 1222.0617 1234.8546 1243.4895 1251.2176 1265.0812 1273.6916 1284.9801 1290.7245 1293.6657 1317.0572 1325.1853 1331.1496 1332.5836 1346.3311 1389.8648 1419.3801 1456.1014 1457.1749 1457.9288 1464.1518 1464.5818 1479.9047 1481.4422 1560.6027 1582.8348 1630.7833 2981.7890 2992.5187 2993.4837 3004.5307 3018.3455 3028.1916 3034.8345 3052.8423 3063.2622 3075.2551 3097.9787 3120.8573 3133.1055 3152.3205 3168.5205 3235.4947 3612.6855
redmass: 4.0551 4.0204 4.2952 3.8811 2.2753 3.3880 3.1832 2.9263 3.0764 4.8506 2.1824 2.2779 2.8921 4.3863 4.0887 1.2606 2.3969 5.8019 3.0699 3.2842 4.1067 5.3776 3.8600 1.2942 2.2154 5.3263 3.1988 2.2740 3.1412 1.4220 2.9885 1.5114 1.7205 3.1520 4.4213 3.6972 2.4041 3.1254 1.4447 2.8850 1.4217 2.7261 2.0638 2.2943 2.5767 3.0176 1.5534 2.0918 1.8713 1.8942 1.1004 1.1564 1.3243 1.4409 1.9885 1.6662 1.3477 1.1527 1.2626 1.9971 1.3865 1.3307 1.4183 1.2509 1.3315 1.2824 2.0950 5.6287 2.2538 3.7126 1.1364 1.0929 1.0861 1.0820 1.1493 2.6968 6.6508 6.3638 6.9808 1.0594 1.0605 1.0665 1.0820 1.0584 1.0629 1.0975 1.1043 1.1048 1.1073 1.1081 1.0851 1.0904 1.0961 1.0977 1.0984 1.0808
irintensity: 0.0119 2.2977 1.1856 0.5372 0.4040 3.4516 5.4704 0.8518 0.1363 2.0200 2.1057 3.2097 10.2240 6.7357 3.7550 86.8508 2.6005 1.8360 8.8494 5.2999 1.2999 25.8333 9.6348 108.2757 4.5960 1.7424 1.7992 14.5794 23.3100 16.7484 5.4782 2.9947 3.8494 1.7164 1.1976 5.6025 16.0492 19.3693 7.0050 26.6939 4.0133 4.7511 16.9036 0.5586 59.9902 3.6310 40.3442 1.6795 7.5127 3.3854 0.9509 4.1719 8.3005 0.2546 4.8328 15.3893 2.9496 1.8674 0.5303 4.3023 9.5361 0.5969 24.5903 11.0135 2.3480 2.4908 5.0994 53.7371 5.3265 20.4641 4.6598 0.6573 18.5292 20.0722 25.2931 3.5442 19.9663 0.8008 2.5528 27.9071 54.5425 26.7343 47.8795 24.3438 46.6974 47.1580 18.0674 75.0508 1.6446 65.3798 0.1950 22.9106 30.7907 18.2717 0.2107 55.0241
temp: 298.150 k
press: 1.00000 atm
elementType: 7 7 7 6 6 6 6 6 6 6 6 6 6 6 6 6 6 1 1 1 1 1 1 1 1 1 1 1 1 1 1 1 1 1
symmnumber: 1
zpe: 753796.0 jmol-1
zpe.correction: 0.287106 hartree
zpe.thermalcorrener: 0.300297 hartree
zpe.thermalcorrenthalpy: 0.301241 hartree
zpe.thermalcorrgfe: 0.247398 hartree
zpe.sumelectzpe: -706.674932 hartree
zpe.sumelectthermal: -706.661740 hartree
zpe.sumelectthermalent: -706.660796 hartree
zpe.sumelectthermalfe: -706.714639 hartree
dipole: -1.6062 1.5762 0.4870
dipole: 2.3025
quadrupole: -87.8785 -93.1752 -101.7921
quadrupole: 9.5150 1.1524 1.3968
quadrupole: 6.4035 1.1067 -7.5102 9.5150 1.1524 1.3968
hfenergy: -706.9620374 hartree
pointgroup: C01 [X(C14H17N3)]
dipole: 0.6562472 -0.6219304 0.0560981 debye
polarizability: 211.8688202|-6.648663|168.1180783|-15.2991526|9.8995886|107.4801678 unknown
InChI: InChI=1S/C14H17N3/c1-2-5-13-11(4-1)12(10-15-13)14-16-6-3-7-17(14)9-8-16/h1-2,4-5,10,14-15H,3,6-9H2
charge 0 multiplicity 1
34 atoms
N  1.506109 1.134104 0.269459
N  2.274547 -1.029715 -0.396514
N  -1.886004 -2.111445 -0.372943
C  1.190282 -0.008512 -0.667408
C  1.785328 0.40016 1.553885
C  2.32072 -1.032686 1.112413
C  2.736605 1.826498 -0.25482
C  3.556547 -0.49723 -0.97871
C  3.972742 0.884519 -0.387329
C  -0.183386 -0.590421 -0.439007
C  -1.417397 0.11443 -0.130166
C  -0.510253 -1.937707 -0.57996
C  -2.471437 -0.869045 -0.095174
C  -1.740057 1.474539 0.128261
C  -3.81557 -0.532365 0.179485
C  -3.078881 1.815527 0.400861
C  -4.10628 0.824946 0.425638
H  1.284306 0.354465 -1.708501
H  0.841668 0.300525 2.115732
H  2.504883 0.966815 2.16901
H  3.347797 -1.240463 1.458081
H  1.65419 -1.823714 1.493113
H  2.96975 2.677678 0.409762
H  2.46895 2.247476 -1.242778
H  3.403987 -0.418323 -2.072055
H  4.354665 -1.243682 -0.815011
H  4.749412 1.356044 -1.020464
H  4.426825 0.733835 0.611162
H  0.151524 -2.76852 -0.813939
H  -2.379315 -2.999914 -0.417078
H  -0.941802 2.222572 0.129745
H  -4.606311 -1.29109 0.202199
H  -3.341857 2.860122 0.603099
H  -5.138188 1.124173 0.642255
