program: Gaussian 09
title: 000256811
version: EM64L-G09RevD.01
frameworkgroup: C1[X(C7H8ClNO2S)]
method: RPBEPBE
basis: SDD
operation: Freq
keyword: #p
keyword: freq=noraman
keyword: PBEPBE/SDD
title: #p freq=noraman PBEPBE/SDD
converged: NO NO NO NO
title: Mulliken charges:
elementType: Cl S O O N C C C C C C C H H H H H H H H
charge: -0.033458 0.951408 -0.537148 -0.535746 -0.720282 -0.028843 0.538733 -0.231078 -0.239093 -0.253194 -0.376876 -0.787871 0.307961 0.286688 0.250066 0.251661 0.252993 0.227123 0.338557 0.338398
chargesum: 0.00000
title: Mulliken charges with hydrogens summed into heavy atoms:
elementType: Cl S O O N C C C C C C C
charge: -0.033458 0.951408 -0.537148 -0.535746 -0.043327 -0.028843 0.538733 0.076884 0.047595 -0.253194 -0.126810 -0.056094
polarizability: 1.67293972e+02 -4.24703492e+00 1.29927006e+02 -2.11450849e+00 -3.89608456e-01 7.27694055e+01
1716.lowfreq: 0.0025 0.0028 0.0033 5.7111 9.0581 12.5901 30.3880 82.2097 112.9158
frequency: 30.0869 82.2094 112.9058 114.8957 123.0195 154.7047 192.8405 210.4435 245.5322 264.4774 287.4330 298.4459 353.9901 401.0472 418.8345 440.7557 446.8367 470.5604 570.7648 604.4916 676.7456 706.6615 781.7790 791.1972 816.3355 835.3860 897.2593 904.8339 968.5826 993.7648 1030.4581 1048.6115 1066.1878 1074.6594 1147.5546 1213.8887 1262.0186 1369.0447 1378.2971 1404.4588 1455.2595 1460.6477 1472.2862 1536.0504 1583.6034 1588.6317 2988.1091 3067.4216 3100.6767 3144.6631 3167.9449 3170.5101 3367.2536 3535.0526
redmass: 6.4427 4.1858 1.5780 9.7926 1.0658 3.3965 5.7223 8.3175 6.4366 2.9126 6.9713 3.6157 5.3074 8.3552 11.1959 3.0135 3.5838 3.5913 4.7242 5.8492 6.8886 3.1790 2.8371 3.4639 4.3321 1.2896 1.4768 3.8003 1.3492 1.5447 4.1554 1.5555 2.1487 1.5891 1.2690 2.4687 1.4142 3.4405 5.8141 1.2440 2.6027 1.0453 1.1291 1.0851 8.0359 6.5748 1.0373 1.0970 1.0999 1.0894 1.0933 1.0962 1.0414 1.1005
irintensity: 0.2644 2.0026 33.7715 2.0049 0.7812 2.9740 0.8358 2.1042 6.8120 8.6268 5.8926 0.9961 4.1772 0.9163 86.6736 2.5082 0.9478 166.8075 29.6043 11.3790 23.1613 5.0698 112.2487 28.9249 108.1608 23.0871 18.5367 50.1102 0.3667 2.4152 45.4438 11.0545 48.6072 20.6593 7.6266 1.7633 7.9261 20.0633 13.1453 20.4850 40.7624 15.9668 23.2279 23.8243 7.3210 9.4257 12.8139 10.0745 15.0832 7.8975 4.1460 10.2101 30.9327 27.4920
temp: 298.150 k
press: 1.00000 atm
elementType: 17 16 8 8 7 6 6 6 6 6 6 6 1 1 1 1 1 1 1 1
symmnumber: 1
zpe: 363844.9 jmol-1
zpe.correction: 0.138581 hartree
zpe.thermalcorrener: 0.151762 hartree
zpe.thermalcorrenthalpy: 0.152706 hartree
zpe.thermalcorrgfe: 0.098148 hartree
zpe.sumelectzpe: -1333.792829 hartree
zpe.sumelectthermal: -1333.779648 hartree
zpe.sumelectthermalent: -1333.778704 hartree
zpe.sumelectthermalfe: -1333.833262 hartree
dipole: 2.4549 2.2090 3.0484
dipole: 4.4944
quadrupole: -82.5789 -82.8456 -88.7161
quadrupole: 6.4382 -12.9271 -1.9430
quadrupole: 2.1347 1.8679 -4.0026 6.4382 -12.9271 -1.9430
hfenergy: -1333.9314099 hartree
pointgroup: C01 [X(C7H8Cl1N1O2S1)]
dipole: -1.0791775 -0.7777511 1.1649472 debye
dipolederiv: -0.4311419 0.2984136 -0.0075384 0.3905044 -0.5114682 0.0094302 -0.0006123 0.0030724 -0.0539951 2.1688504 0.0725437 0.257547 0.1665481 1.178704 0.0388437 0.2391571 0.0258937 1.5902554 -0.7936522 0.0617197 0.0091287 0.068087 -0.5844807 -0.1736568 -0.0292556 -0.0048747 -0.542644 -0.741662 -0.0625155 -0.0439252 -0.1186486 -0.6196085 0.1689537 -0.0300452 -0.0062714 -0.5420734 -0.7344405 -0.0430478 -0.0778424 -0.0591818 -0.3683954 -0.0075879 -0.1675747 -0.0064641 -0.9064837 -0.0941147 0.0100761 0.0426691 -0.0167598 -0.0424966 0.0060209 0.1289284 0.0128415 -0.1691228 0.369119 0.1796491 -0.0030614 0.1483705 -0.1928387 0.0044559 -0.0001087 0.0024446 0.0296521 -0.307762 0.2019075 -0.0204129 -0.1322821 -0.2058024 -0.0002746 -0.0084468 -0.0195819 -0.0389297 -0.2278795 -0.113608 -0.0193953 0.171321 -0.0422152 -0.003614 -0.0170271 0.0234446 -0.0854789 0.4286008 -0.5925379 0.010087 -0.6479138 0.7326928 -0.0155334 -0.0061713 -0.0086813 -0.0853109 -0.1120357 0.0095172 0.0005754 0.0384217 0.0964778 -0.0002554 -0.0115822 0.0004847 -0.1454854 -0.2433758 0.0013124 -0.0016649 0.0839863 0.1176909 0.0003017 -0.0029966 -0.0007037 0.0382797 0.1541197 -0.0409789 0.0079518 -0.0064924 0.0846445 -0.002294 0.000401 0.007405 0.157127 0.0991757 0.0700533 0.0061887 0.0413388 0.0865828 0.004887 0.0030964 -0.0081391 0.1579748 0.0066734 -0.0702245 -0.0001492 -0.0596961 -0.052318 -0.0012938 0.0039052 -0.0011579 0.1558292 0.0181373 -0.0040019 0.0432476 0.0122806 0.0717029 -0.0909245 0.0834375 -0.0544558 -0.0163623 0.0167611 -0.0043864 -0.0446953 0.0111243 0.0743514 0.0886155 -0.0825443 0.0529471 -0.0164189 0.0777122 0.0134613 0.0002195 -0.0994047 -0.1295724 0.0016866 0.0009199 0.0015259 0.1136862 0.1581939 0.0682704 -0.0626562 0.0220304 0.172446 -0.1109704 -0.042871 -0.0613099 0.1788506 0.1887207 -0.0556237 -0.0962735 -0.0136339 0.1339032 0.0832094 -0.0606098 0.0415804 0.1806503 unknown
polarizability: 165.9175997|-7.8375846|131.110656|4.6800367|0.3315619|72.9621284 unknown
InChI: InChI=1S/C7H8ClNO2S/c1-5-2-3-6(4-7(5)8)12(9,10)11/h2-4H,9H2,1H3
charge 0 multiplicity 1
20 atoms
Cl -2.763962 2.176142 -0.023946
S  2.426073 0.130177 -0.054295
O  3.116053 -1.217989 -0.658988
O  2.675383 1.628106 -0.64905
N  2.884989 0.19098 1.720261
C  0.566709 -0.157494 -0.016162
C  -2.213744 -0.573896 -0.000419
C  -0.267193 0.970175 -0.022933
C  0.093473 -1.477087 -0.014983
C  -1.653616 0.730794 -0.013819
C  -1.305719 -1.666076 -0.007353
C  -3.708903 -0.803104 0.0071
H  0.14875 1.981147 -0.061105
H  0.790661 -2.319722 -0.044976
H  -1.710381 -2.683809 -0.009346
H  -4.179776 -0.335113 0.890916
H  -4.186322 -0.348901 -0.880413
H  -3.943864 -1.879992 0.016117
H  3.553372 -0.574181 1.910303
H  3.262615 1.130342 1.928489
