program: Gaussian 09
title: 000256809
version: EM64L-G09RevD.01
frameworkgroup: C1[X(C13H15N3O4)]
method: RPBEPBE
basis: SDD
operation: Freq
keyword: #p
keyword: freq=noraman
keyword: PBEPBE/SDD
title: #p freq=noraman PBEPBE/SDD
converged: YES YES NO NO
title: Mulliken charges:
elementType: O O O O N N N C C C C C C C C C C C C C H H H H H H H H H H H H H H H
charge: -0.257520 -0.257517 -0.237186 -0.237218 -0.404079 -0.404144 -0.112050 0.158900 0.158876 -0.616699 -0.616627 -0.298100 -0.298096 0.190284 0.190252 -0.176511 0.276908 0.276933 -0.766512 -0.766529 0.264501 0.271899 0.271932 0.264472 0.381038 0.381095 0.305783 0.305779 0.236220 0.243733 0.250088 0.263132 0.243742 0.250090 0.263133
chargesum: 0.00000
title: Mulliken charges with hydrogens summed into heavy atoms:
elementType: O O O O N N N C C C C C C C C C C C C C
charge: -0.257520 -0.257517 -0.237186 -0.237218 -0.023041 -0.023050 -0.112050 0.158900 0.158876 -0.080299 -0.080224 0.007683 0.007683 0.190284 0.190252 0.059709 0.276908 0.276933 -0.009559 -0.009564
polarizability: 2.79473453e+02 -6.26370775e-04 1.92875228e+02 7.34799276e+00 6.72314535e-03 9.41878066e+01
1716.lowfreq: -6.5836 -2.8320 -0.0010 -0.0008 -0.0002 5.5511 20.9281 28.3373 40.3043
frequency: 20.8265 28.2515 40.2853 42.7077 50.2682 77.9105 78.0722 88.8190 111.0856 113.9142 142.9123 146.7823 181.7178 226.8907 230.2358 242.7617 281.7217 294.5933 298.2517 368.9361 370.3354 416.8712 450.9278 452.8887 459.4893 516.3152 530.1797 554.7387 561.3273 587.9957 594.8736 657.3193 668.7141 735.6562 743.5378 808.9911 817.3751 817.5554 826.7144 857.4389 882.8723 907.4298 907.6949 919.3422 925.4112 929.5221 957.6691 963.9649 981.2061 1004.4001 1023.9996 1024.1922 1029.4771 1076.9772 1160.7447 1162.3623 1174.6754 1180.5890 1182.7564 1205.5807 1215.7527 1265.3641 1312.3239 1312.5161 1315.1723 1361.4956 1371.5531 1371.7055 1375.1473 1418.8110 1419.4731 1441.0551 1441.1625 1450.8872 1451.1217 1451.6480 1514.9833 1548.3613 1578.3815 1586.5038 1606.3298 1607.5542 1632.8088 1632.9793 2974.1894 2974.1996 2981.4857 2981.4874 3063.6548 3063.6602 3085.2262 3085.2565 3127.5869 3127.6035 3150.8867 3202.9857 3206.5797 3308.4829 3311.3973
redmass: 4.0663 3.6728 3.9330 5.0822 6.4265 2.6775 5.1369 6.6435 2.9258 6.3287 1.1515 1.2893 7.1522 6.3544 6.4227 4.4409 4.9974 4.4527 4.6076 5.2888 4.0276 4.4029 2.5142 3.4006 3.0078 4.7716 4.4166 3.7532 3.7233 5.2420 4.3812 5.9167 5.4718 5.0452 2.8025 3.6763 2.6377 2.2126 1.5897 2.8022 2.3608 1.9800 1.3686 1.3936 3.6651 1.3755 5.1224 2.0098 2.0589 1.3052 1.8453 1.8539 3.5366 1.5599 1.5793 1.5613 1.1722 1.6471 1.6929 2.6341 2.9575 2.0711 1.9073 1.8274 3.4234 5.9553 1.2489 1.2546 3.0356 1.0920 1.0924 1.0738 1.0711 1.3770 1.0543 1.8289 1.9064 2.4686 6.9663 4.6273 7.3344 8.1221 5.4071 5.1576 1.0663 1.0663 1.0392 1.0392 1.0954 1.0954 1.0915 1.0915 1.1002 1.1002 1.0912 1.0937 1.0977 1.0798 1.0797
irintensity: 0.7525 2.2643 1.3535 0.0483 3.9364 0.5284 22.5161 0.4972 6.4203 0.7660 0.4653 2.5674 11.4390 0.8568 39.5097 0.4244 3.7605 2.7725 3.3375 0.8214 0.1989 1.5391 2.6116 1.4037 0.0129 67.3503 31.0527 0.3766 4.1053 2.6672 4.3607 2.1666 5.0604 2.5112 16.3058 6.6421 0.3335 14.7976 65.7873 15.9125 0.0183 29.5058 4.5218 135.4121 0.0032 0.0031 0.0037 4.9575 15.9260 5.0658 4.2713 33.2955 27.7321 26.9902 20.2144 47.3105 41.2509 4.3412 0.8573 70.2318 137.5830 146.9478 112.4279 67.1229 10.6010 49.0478 137.2039 33.0847 3.1232 139.4112 3.9355 29.5029 7.6937 295.4936 9.9519 406.6373 996.4374 182.7579 382.7260 31.0658 0.3604 116.8160 166.2702 163.4820 0.9996 1.1951 2.7750 0.2167 4.5872 12.3386 13.9262 0.6931 3.2048 16.5741 15.7250 12.5875 0.1096 94.9448 429.0080
temp: 298.150 k
press: 1.00000 atm
elementType: 8 8 8 8 7 7 7 6 6 6 6 6 6 6 6 6 6 6 6 6 1 1 1 1 1 1 1 1 1 1 1 1 1 1 1
symmnumber: 1
zpe: 702356.5 jmol-1
zpe.correction: 0.267513 hartree
zpe.thermalcorrener: 0.287669 hartree
zpe.thermalcorrenthalpy: 0.288613 hartree
zpe.thermalcorrgfe: 0.215416 hartree
zpe.sumelectzpe: -968.109676 hartree
zpe.sumelectthermal: -968.089520 hartree
zpe.sumelectthermalent: -968.088576 hartree
zpe.sumelectthermalfe: -968.161774 hartree
dipole: -0.0004 3.8575 0.0029
dipole: 3.8575
quadrupole: -74.2961 -121.6481 -114.5586
quadrupole: -0.0035 -0.5879 0.0093
quadrupole: 29.2048 -18.1472 -11.0576 -0.0035 -0.5879 0.0093
hfenergy: -968.3771892 hartree
pointgroup: C01 [X(C13H15N3O4)]
dipole: -0.0011287 -1.5176634 -0.0025293 debye
polarizability: 276.4274496|-0.0240977|192.8751308|-24.6797915|0.1107256|97.2339072 unknown
InChI: InChI=1S/C13H15N3O4/c1-8(17)6-12(19)15-10-4-3-5-11(14-10)16-13(20)7-9(2)18/h3-5,15-16H,6-7H2,1-2H3
charge 0 multiplicity 1
35 atoms
O  4.00473 1.700602 -0.715737
O  -4.003153 1.703905 0.719277
O  3.151595 -2.4519 -0.053609
O  -3.154107 -2.448582 0.050677
N  2.268133 0.135339 -0.434467
N  -2.268427 0.137172 0.434664
N  -0.000054 0.282484 0.000288
C  1.15109 0.97873 -0.215917
C  -1.150329 0.979672 0.218083
C  4.561608 -0.657069 -0.938817
C  -4.562733 -0.653569 0.937674
C  1.209608 2.397371 -0.224295
C  -1.207078 2.398363 0.229726
C  3.579651 0.507161 -0.667752
C  -3.579524 0.51006 0.668609
C  0.001699 3.091011 0.003514
C  4.317933 -2.006565 -0.256428
C  -4.320098 -2.00232 0.25345
C  5.54971 -2.793967 0.147403
C  -5.552475 -2.787663 -0.152552
H  5.572007 -0.278912 -0.71282
H  4.54018 -0.843619 -2.03445
H  -4.541881 -0.841763 2.033037
H  -5.572674 -0.274074 0.711873
H  2.076917 -0.880959 -0.359177
H  -2.078485 -0.879173 0.356911
H  2.158877 2.903873 -0.399294
H  -2.155722 2.905637 0.405868
H  0.002386 4.186122 0.004771
H  6.283208 -2.831289 -0.679243
H  6.051033 -2.287651 0.995457
H  5.271236 -3.814203 0.451867
H  -6.286602 -2.825498 0.673512
H  -6.052629 -2.27941 -1.000138
H  -5.274933 -3.807717 -0.458468
