program: Gaussian 09
title: 000256804
version: EM64L-G09RevD.01
frameworkgroup: C1[X(C12H20Cl4N4O2)]
method: RPBEPBE
basis: SDD
operation: Freq
keyword: #p
keyword: freq=noraman
keyword: PBEPBE/SDD
title: #p freq=noraman PBEPBE/SDD
converged: YES YES NO NO
title: Mulliken charges:
elementType: Cl Cl Cl Cl O O N N N N C C C C C C C C C C C C H H H H H H H H H H H H H H H H H H H H
charge: -0.042515 -0.058447 -0.042515 -0.058447 -0.306965 -0.306965 -0.177472 -0.177472 -0.430909 -0.430907 -0.407555 -0.326422 -0.407548 -0.326420 0.328521 0.328519 -0.567243 -0.575088 -0.567239 -0.575089 -0.147481 -0.147481 0.262568 0.235385 0.229825 0.279341 0.262568 0.235378 0.229825 0.279339 0.275516 0.276600 0.306082 0.255768 0.275518 0.276598 0.306083 0.255767 0.317065 0.317062 0.273424 0.273424
chargesum: 0.00000
title: Mulliken charges with hydrogens summed into heavy atoms:
elementType: Cl Cl Cl Cl O O N N N N C C C C C C C C C C C C
charge: -0.042515 -0.058447 -0.042515 -0.058447 -0.306965 -0.306965 -0.177472 -0.177472 -0.113843 -0.113844 0.090398 0.182744 0.090398 0.182744 0.328521 0.328519 -0.015126 -0.013238 -0.015123 -0.013238 0.125943 0.125943
polarizability: 3.40983899e+02 2.67079823e+01 2.31479069e+02 3.49845009e-04 -1.26436633e-03 1.27252973e+02
1716.lowfreq: -2.9938 -0.0018 -0.0014 -0.0005 1.9968 9.3104 11.2576 16.8515 17.1757
frequency: 11.2242 16.7647 17.1250 25.6222 30.9478 36.5545 42.8812 64.7499 72.0522 76.3542 84.6381 87.4768 91.3132 104.0401 113.1839 149.7740 156.0946 171.9200 187.1450 212.2798 212.8454 222.6285 235.4355 235.7748 259.9451 296.8028 307.5803 349.8573 372.4008 399.2376 404.3458 415.7312 474.1026 533.2933 554.4473 557.2425 584.6721 620.5084 623.3329 683.5417 685.0193 688.3227 689.5816 710.6101 712.4200 779.6244 779.7849 787.4302 787.5576 839.0236 858.5279 863.9853 955.4134 979.3585 991.6637 998.5726 1000.9938 1035.0916 1035.1292 1042.0724 1048.0525 1058.2957 1066.8383 1121.7984 1121.9176 1148.6382 1158.0989 1217.7609 1232.8669 1236.0550 1238.8070 1250.3793 1250.4640 1255.4626 1257.4585 1260.4827 1270.4176 1278.3326 1279.2890 1303.7695 1305.6497 1344.1913 1346.0722 1363.4354 1366.4942 1371.3476 1381.6337 1449.5171 1450.1523 1457.1282 1457.6004 1463.4333 1464.4209 1478.6543 1488.0888 1502.7346 1513.1519 1606.0578 1608.5846 1714.0209 3003.5218 3003.5603 3029.8574 3029.8971 3059.9994 3060.0055 3061.2007 3061.2162 3069.3087 3069.3547 3100.9741 3100.9778 3143.8483 3143.8818 3155.0989 3155.1040 3157.5561 3162.1878 3561.4503 3561.8915
redmass: 14.4529 11.1288 16.5863 17.8434 12.5503 9.8840 11.1531 5.4846 3.6699 3.6406 5.6443 2.8449 3.0588 2.5552 3.3524 4.9272 5.6630 5.2466 2.1530 5.1864 4.4319 7.1317 6.7997 4.6892 5.2115 4.0586 3.4977 3.6948 4.9572 2.9349 3.8774 6.6985 4.6359 1.2317 1.3900 4.4758 4.1605 5.3597 4.8646 6.8466 8.2165 7.6652 5.2824 5.6145 5.2688 1.1781 1.1991 1.1437 1.1336 1.8149 5.4229 4.7580 1.0803 2.3003 1.7020 1.4334 1.5237 4.5810 4.5044 1.9882 3.1263 2.9179 2.0626 1.3570 1.3755 2.3172 2.0632 2.0166 2.2190 2.2616 2.7036 1.1743 1.1607 1.3579 1.1951 1.2644 1.2214 1.3881 1.3488 1.3639 1.3877 1.3655 1.3479 1.3554 1.3199 1.2639 1.6209 1.0988 1.0932 1.1231 1.0964 1.1194 1.0976 2.3100 1.5941 1.0848 1.2992 5.5170 7.1710 5.5518 1.0643 1.0643 1.0615 1.0615 1.0584 1.0584 1.0577 1.0577 1.0980 1.0980 1.1034 1.1034 1.1119 1.1119 1.1115 1.1115 1.1002 1.0846 1.0764 1.0766
irintensity: 0.1678 0.0727 0.1728 0.0015 2.0614 0.0055 0.0245 0.1740 11.4475 1.3993 19.9538 3.3498 6.1909 2.8924 0.0832 0.0178 0.3277 0.9065 0.0489 4.9595 0.0137 0.8644 9.8765 5.3491 4.7264 29.8623 0.0508 22.3979 6.0514 3.6545 6.1426 28.5072 4.8125 0.1967 140.2442 50.1560 4.3886 3.5897 27.5966 3.2969 38.5381 14.2196 85.9005 103.6482 40.4819 15.5693 1.0527 22.4384 0.0126 0.0173 0.1462 0.4593 112.1096 52.2775 0.4659 5.1536 0.5376 0.1531 1.9684 2.2149 0.1018 0.6130 0.0722 80.1858 3.3634 0.6081 218.4506 452.1544 2.1287 14.2380 1.8958 1.7696 19.6241 6.5378 2.1309 40.3603 0.0147 0.0232 583.7061 2.4774 92.8947 0.8177 65.2805 0.0984 87.1731 0.0524 294.0899 0.2078 50.8926 19.6078 12.7617 23.7570 33.1161 5.0048 1053.2400 8.5047 418.6901 534.9512 1.2711 0.1836 11.1052 21.5856 22.4535 9.4388 6.9754 9.1308 15.3535 30.5547 22.1685 0.5860 2.0356 2.6894 28.8003 0.1154 6.4915 7.9565 0.0022 78.5625 17.7013 0.0383
temp: 298.150 k
press: 1.00000 atm
elementType: 17 17 17 17 8 8 7 7 7 7 6 6 6 6 6 6 6 6 6 6 6 6 1 1 1 1 1 1 1 1 1 1 1 1 1 1 1 1 1 1 1 1
symmnumber: 1
zpe: 856493.3 jmol-1
zpe.correction: 0.326221 hartree
zpe.thermalcorrener: 0.352612 hartree
zpe.thermalcorrenthalpy: 0.353556 hartree
zpe.thermalcorrgfe: 0.261539 hartree
zpe.sumelectzpe: -2677.263764 hartree
zpe.sumelectthermal: -2677.237373 hartree
zpe.sumelectthermalent: -2677.236429 hartree
zpe.sumelectthermalfe: -2677.328446 hartree
dipole: 0.0000 0.0000 0.2789
dipole: 0.2789
quadrupole: -184.0078 -192.6453 -158.9347
quadrupole: -26.1956 -0.0009 0.0004
quadrupole: -5.4785 -14.1160 19.5946 -26.1956 -0.0009 0.0004
hfenergy: -2677.589985 hartree
pointgroup: C01 [X(C12H20Cl4N4O2)]
dipole: -0.0000037 0.0000089 -0.1097451 debye
polarizability: 342.3166721|-23.7822399|230.1462954|-0.0003164|-0.0012732|127.2529734 unknown
InChI: InChI=1S/C12H20Cl4N4O2/c13-1-7-19(8-2-14)11(21)17-5-6-18-12(22)20(9-3-15)10-4-16/h5-6,17-18H,1-4,7-10H2
charge 0 multiplicity 1
42 atoms
Cl 4.416767 4.053481 -1.387077
Cl 7.501102 -2.037713 1.361618
Cl -4.416797 -4.053538 -1.386894
Cl -7.500891 2.03776 1.3618
O  2.971174 -1.807934 0.038418
O  -2.971076 1.807954 0.038312
N  4.247239 0.153504 0.020667
N  -4.247137 -0.153489 0.020632
N  1.859704 0.247286 -0.000976
N  -1.859604 -0.247266 -0.001054
C  4.375374 1.621484 0.004085
C  5.478021 -0.670553 -0.00088
C  -4.375265 -1.621469 0.004138
C  -5.477926 0.67056 -0.000834
C  3.021439 -0.538526 0.019915
C  -3.02134 0.538547 0.019752
C  4.294558 2.170476 -1.43444
C  5.855142 -1.114017 1.422299
C  -4.294611 -2.170534 -1.434368
C  -5.854917 1.114079 1.422362
C  0.580395 -0.355727 0.006182
C  -0.580295 0.355747 0.00613
H  5.348993 1.900565 0.442722
H  3.610467 2.102872 0.642732
H  6.297688 -0.07862 -0.444494
H  5.307536 -1.562274 -0.625589
H  -5.348832 -1.900535 0.442899
H  -3.610281 -2.102819 0.642723
H  -6.29763 0.078605 -0.444349
H  -5.307503 1.562258 -0.625594
H  3.337904 1.940462 -1.926902
H  5.134014 1.825593 -2.055737
H  5.120556 -1.822272 1.829276
H  6.014015 -0.264469 2.10382
H  -3.338017 -1.940537 -1.926955
H  -5.134143 -1.82569 -2.055584
H  -5.120299 1.822357 1.829242
H  -6.01372 0.264557 2.103933
H  1.911093 1.265972 -0.010051
H  -1.910994 -1.265953 -0.010063
H  0.625929 -1.449092 0.009053
H  -0.625829 1.449112 0.008929
