program: Gaussian 09
title: 000256791
version: EM64L-G09RevD.01
frameworkgroup: C1[X(C15H15N3O6)]
method: RPBEPBE
basis: SDD
operation: Freq
keyword: #p
keyword: freq=noraman
keyword: PBEPBE/SDD
title: #p freq=noraman PBEPBE/SDD
converged: YES YES NO NO
title: Mulliken charges:
elementType: O O O O O O N N N C C C C C C C C C C C C C C C H H H H H H H H H H H H H H H
charge: -0.234802 -0.240383 -0.238748 -0.253200 -0.438493 -0.243212 -0.320144 -0.046244 -0.039381 0.229718 0.450333 -0.139455 -0.366280 -0.354644 0.223214 0.266786 -0.354877 -0.315938 0.248360 -0.253036 -0.258666 0.116558 -0.661691 -0.663557 0.307954 0.281703 0.278946 0.281932 0.234783 0.243395 0.232785 0.230312 0.231603 0.248421 0.224248 0.218646 0.236019 0.248320 0.388718
chargesum: 0.00000
title: Mulliken charges with hydrogens summed into heavy atoms:
elementType: O O O O O O N N N C C C C C C C C C C C C C C C
charge: -0.234802 -0.240383 -0.238748 -0.253200 -0.049774 -0.243212 -0.320144 -0.046244 -0.039381 0.229718 0.450333 -0.139455 -0.058326 -0.072941 0.223214 0.266786 -0.075930 -0.034006 0.248360 0.225142 0.204431 0.116558 0.042581 0.039427
polarizability: 3.41188477e+02 9.20040082e+00 1.91660086e+02 4.83026495e+00 2.54602544e+01 1.34391170e+02
1716.lowfreq: -8.0481 -3.2717 -2.5014 -0.0005 0.0005 0.0007 14.7324 22.7043 32.6636
frequency: 14.4388 22.6898 32.4500 35.8651 50.7417 61.2646 63.5916 76.3529 78.5072 94.2634 109.8704 124.3377 137.0724 163.0438 195.0652 202.7149 217.3439 221.6426 239.7263 284.0310 299.9498 315.4306 321.5762 346.9173 398.1650 411.4355 427.8726 447.0601 455.6742 476.3384 508.3503 512.7469 548.3240 597.7112 620.9350 626.4133 645.9961 668.0450 687.4605 706.6264 731.4194 744.2395 758.4540 759.3142 768.8133 808.3576 816.0639 817.6720 829.5977 853.5458 870.1433 889.6074 961.3933 991.5470 994.1641 1002.5076 1006.3301 1008.5261 1026.2324 1043.0094 1095.1041 1095.7256 1111.9544 1130.2069 1150.4490 1155.6392 1158.5361 1174.7874 1202.9720 1219.5989 1228.0803 1274.9867 1277.6920 1312.5414 1322.1868 1327.8069 1352.5363 1361.6227 1386.3976 1391.1333 1393.7971 1414.6401 1427.2652 1456.0155 1459.1642 1462.4921 1464.2659 1483.5200 1484.4356 1498.7056 1517.3748 1579.8206 1607.6069 1619.5415 1621.9798 1644.5264 2994.6763 2995.9938 3031.9466 3040.9005 3090.3153 3091.1075 3097.0789 3100.1552 3122.9354 3128.6147 3158.6409 3173.6209 3174.7976 3191.5960 3532.7472
redmass: 4.2292 5.6135 3.2015 4.7604 6.5319 4.3025 3.6681 4.6177 5.6422 5.7220 5.3707 5.0051 5.2928 7.1775 2.9110 2.4706 1.4710 3.2105 3.2851 4.3182 2.8510 4.2665 4.9883 6.8655 6.7647 2.9502 3.9135 5.5401 5.3057 6.3313 5.9240 4.7248 5.8346 1.2764 5.3045 7.1744 11.7329 8.5551 3.6798 8.0994 3.8621 3.0824 4.8715 6.5384 5.6897 2.3179 1.6267 1.7149 3.8918 1.8691 1.9476 1.9900 8.1185 1.3722 2.8661 3.5097 1.5019 2.5825 3.3435 4.5852 2.1659 2.1672 4.5413 1.4752 1.7477 1.6969 1.7222 5.3092 1.2497 7.4323 9.5976 1.1294 1.1231 1.4991 2.7087 2.4897 1.2900 1.6699 7.7437 1.2341 1.2322 4.7443 4.1566 1.1337 1.1080 1.0430 1.0458 1.0641 1.0583 3.3739 5.0034 7.9462 9.7942 6.5471 9.6018 8.8315 1.0361 1.0362 1.0600 1.0599 1.0977 1.0971 1.1024 1.1026 1.1063 1.1075 1.0898 1.0900 1.0968 1.0976 1.0642
irintensity: 0.8779 0.6651 0.6436 1.2607 0.1347 0.6194 1.5693 0.2830 0.5464 0.2389 0.9182 1.5410 2.2743 3.6459 2.8718 0.9426 4.2522 0.2984 3.0578 3.8906 13.8856 20.2259 8.2477 4.1215 19.6777 1.1844 6.7073 5.3391 3.8057 21.3418 9.3567 22.6456 6.9316 73.4362 42.4924 2.4925 6.0220 2.8716 73.4363 28.3604 3.2475 16.1682 10.4130 11.3154 12.2974 6.8210 3.8386 11.4172 10.9714 19.9871 23.6764 41.9039 92.7028 2.9159 21.5980 170.4227 6.6657 12.4900 233.7253 179.9064 31.3017 35.0097 220.5596 25.0121 176.6294 11.5455 33.8342 286.3418 21.5182 89.9208 71.9124 10.1179 12.8723 24.0967 169.9438 60.3992 2.6558 15.1926 3.1318 25.3713 22.1062 92.7165 69.7250 9.4560 16.7278 16.8898 10.2058 8.5490 12.8503 198.0677 29.2696 7.0500 184.7330 52.4386 147.4754 304.7444 21.2089 14.7668 32.9717 19.0370 33.6019 32.8255 2.9704 3.3671 29.5709 22.4885 4.6953 0.0096 4.6075 0.2182 60.1928
temp: 298.150 k
press: 1.00000 atm
elementType: 8 8 8 8 8 8 7 7 7 6 6 6 6 6 6 6 6 6 6 6 6 6 6 6 1 1 1 1 1 1 1 1 1 1 1 1 1 1 1
symmnumber: 1
zpe: 753164.2 jmol-1
zpe.correction: 0.286865 hartree
zpe.thermalcorrener: 0.310248 hartree
zpe.thermalcorrenthalpy: 0.311193 hartree
zpe.thermalcorrgfe: 0.230052 hartree
zpe.sumelectzpe: -1194.424388 hartree
zpe.sumelectthermal: -1194.401004 hartree
zpe.sumelectthermalent: -1194.400060 hartree
zpe.sumelectthermalfe: -1194.481201 hartree
dipole: -0.6940 2.1756 -2.3389
dipole: 3.2688
quadrupole: -114.5482 -136.9186 -140.6250
quadrupole: -9.6187 -7.3255 -6.1290
quadrupole: 16.1491 -6.2213 -9.9278 -9.6187 -7.3255 -6.1290
hfenergy: -1194.7112528 hartree
pointgroup: C01 [X(C15H15N3O6)]
dipole: 0.2273894 -0.9195326 -0.8698591 debye
polarizability: 341.5375117|2.2463125|187.9731246|-8.306071|-28.4377736|137.729097 unknown
InChI: InChI=1S/C15H15N3O6/c1-3-23-14(21)11-12(15(22)24-4-2)18(17-16-11)10-7-5-9(6-8-10)13(19)20/h5-8,19H,3-4H2,1-2H3
charge 0 multiplicity 1
39 atoms
O  1.386221 -2.173297 -0.776166
O  4.554176 1.143209 -0.725456
O  0.489631 -1.852922 1.35826
O  3.91371 -0.853749 0.314797
O  -6.348919 1.327129 -0.819121
O  -6.287143 -0.234202 0.899975
N  0.039071 0.947233 -0.225202
N  0.582548 2.237809 -0.587884
N  1.905969 2.096873 -0.62443
C  1.069786 0.042846 -0.065051
C  -1.387808 0.813112 -0.139727
C  2.24753 0.776394 -0.3159
C  -1.986146 -0.037453 0.823046
C  -2.179728 1.593302 -1.019337
C  0.937172 -1.406047 0.274725
C  -4.193551 0.64035 -0.005744
C  -3.389212 -0.124291 0.876721
C  -3.58063 1.505413 -0.948638
C  3.628352 0.259396 -0.199514
C  1.471362 -3.656061 -0.540629
C  5.993533 0.746026 -0.602797
C  -5.671855 0.509548 0.098884
C  0.138822 -4.331103 -0.870111
C  6.555899 1.18063 0.753036
H  -1.368343 -0.606522 1.522941
H  -1.690231 2.255699 -1.737395
H  -3.879557 -0.773325 1.608984
H  -4.208421 2.096464 -1.620131
H  2.28073 -3.966897 -1.218858
H  1.768751 -3.818618 0.509336
H  6.070766 -0.34649 -0.742863
H  6.472718 1.275757 -1.440832
H  -0.178735 -4.098161 -1.900845
H  -0.651101 -4.013209 -0.169594
H  0.252874 -5.427582 -0.784883
H  7.64043 0.967821 0.789592
H  6.410155 2.263068 0.908826
H  6.069789 0.631001 1.576339
H  -7.328314 1.199649 -0.702054
