program: Gaussian 09
title: 000256788
version: EM64L-G09RevD.01
frameworkgroup: C1[X(C8H9N7OS)]
method: RPBEPBE
basis: SDD
operation: Freq
keyword: #p
keyword: freq=noraman
keyword: PBEPBE/SDD
title: #p freq=noraman PBEPBE/SDD
converged: NO YES NO NO
title: Mulliken charges:
elementType: S O N N N N N N N C C C C C C C C H H H H H H H H H
charge: 0.274218 -0.313013 -0.055189 0.005910 0.064862 0.010629 -0.604716 -0.620780 -0.609756 -0.122530 -0.021958 -0.049817 0.134384 0.107139 -0.440452 0.190404 -0.822541 0.339400 0.335633 0.328592 0.384417 0.339857 0.338405 0.284715 0.284657 0.237530
chargesum: 0.00000
title: Mulliken charges with hydrogens summed into heavy atoms:
elementType: S O N N N N N N N C C C C C C C C
charge: 0.274218 -0.313013 -0.055189 0.005910 0.064862 0.010629 0.070318 0.092230 0.068506 -0.122530 -0.021958 -0.049817 0.134384 0.107139 -0.440452 0.190404 -0.015639
polarizability: 3.16811018e+02 5.23838777e+00 1.88553276e+02 -3.30360794e-04 8.82432736e-04 6.44078779e+01
1716.lowfreq: -4.6737 -0.0016 -0.0007 0.0008 2.8537 8.1644 36.7336 74.7011 80.5427
frequency: 36.7070 74.6892 80.5423 101.2572 118.7142 122.2090 152.8848 176.8100 195.6053 260.6596 274.5198 283.9321 308.3244 326.1216 347.2573 425.7641 435.8561 470.5438 487.0797 537.1889 537.2413 553.4459 571.7842 573.9065 607.1454 631.2919 641.4806 649.2056 658.5966 667.9372 670.6248 692.0599 745.1852 775.8413 795.2539 800.1776 825.8263 884.7487 981.4776 993.6655 1015.0146 1051.9780 1059.7578 1114.9924 1161.3439 1204.4871 1286.6172 1318.1702 1334.7549 1347.3889 1385.8715 1392.1061 1425.2558 1433.0123 1447.1692 1450.9788 1496.9780 1509.9849 1535.2429 1557.2557 1595.1819 1608.9936 1624.6873 3023.5021 3147.0075 3156.5344 3351.7514 3512.3758 3537.5482 3619.7711 3677.0446 3694.0900
redmass: 5.2635 3.4177 4.6075 1.2893 4.9210 4.5938 7.7427 4.1961 7.6336 3.4666 10.9476 4.3274 11.4542 5.6825 3.6018 8.2457 5.2341 4.0885 5.8536 1.3050 6.7804 1.2360 1.1006 5.1406 1.3803 6.1468 1.1435 5.1953 5.1190 7.0068 8.9587 7.8910 9.8325 2.4918 1.9635 7.4585 5.1258 5.8400 1.1826 1.3470 2.3458 2.3651 2.5432 5.1633 3.2773 4.3976 6.6561 6.5850 6.6897 1.2484 5.5533 6.0845 4.5008 1.0513 2.6695 1.1687 3.6451 3.6148 3.7549 1.4157 2.5912 1.9045 3.0623 1.0288 1.1038 1.1051 1.0577 1.0444 1.0438 1.0943 1.1045 1.1055
irintensity: 0.5016 2.9744 0.6603 3.4923 7.8114 2.3965 0.3952 2.2260 1.1987 21.0778 0.7862 15.3167 0.7636 2.4358 6.0331 5.7006 6.5042 47.2702 5.3240 106.1227 3.1631 78.2704 0.7011 8.3035 322.2854 5.8520 110.6954 11.8841 28.2651 0.5816 26.2299 16.7653 18.7297 32.5851 78.4064 11.8292 47.6235 39.0544 8.0696 11.1190 38.1995 12.6491 5.2418 36.2284 13.7343 129.2376 51.9835 78.4958 525.7465 8.1894 75.1290 352.3153 8.8836 14.3886 22.9420 31.1929 47.5197 423.1549 702.6001 111.2892 494.0306 423.6252 258.4030 24.5381 12.6750 9.4095 241.0136 24.9384 112.2163 80.3813 91.4697 43.6114
temp: 298.150 k
press: 1.00000 atm
elementType: 16 8 7 7 7 7 7 7 7 6 6 6 6 6 6 6 6 1 1 1 1 1 1 1 1 1
symmnumber: 1
zpe: 487779.8 jmol-1
zpe.correction: 0.185786 hartree
zpe.thermalcorrener: 0.201350 hartree
zpe.thermalcorrenthalpy: 0.202294 hartree
zpe.thermalcorrgfe: 0.142736 hartree
zpe.sumelectzpe: -1165.635331 hartree
zpe.sumelectthermal: -1165.619767 hartree
zpe.sumelectthermalent: -1165.618823 hartree
zpe.sumelectthermalfe: -1165.678381 hartree
dipole: -2.4229 3.0418 0.0063
dipole: 3.8888
quadrupole: -108.6749 -84.2001 -108.5029
quadrupole: -14.9420 -0.0248 0.0010
quadrupole: -8.2156 16.2592 -8.0436 -14.9420 -0.0248 0.0010
hfenergy: -1165.8211165 hartree
pointgroup: C01 [X(C8H9N7O1S1)]
dipole: 0.933801 1.2036899 0.1412859 debye
dipolederiv: -0.993881 -0.2498012 -0.0672029 -0.1184555 0.0170822 0.0000434 -0.0564151 -0.0064444 -0.0611327 -1.1583431 0.2855714 -0.016521 0.1467056 -0.8174192 -0.0279437 -0.0276849 -0.0208734 -0.3792487 0.9504761 -0.306956 0.0338977 -0.5564727 -0.2609651 -0.0323919 0.0139842 -0.0195386 -0.2090866 -1.1086854 0.6020383 0.0078962 0.323892 -0.4252261 0.006462 -0.0146625 0.0204041 -0.3008704 -1.8880064 0.3291192 -0.0585707 0.5283501 -0.610581 -0.0065168 -0.0426587 -0.0165231 -0.2029723 -1.2465384 -0.7164401 -0.1094523 -0.5573448 -1.0843951 -0.0980054 -0.0968281 -0.1059177 -0.227713 -0.3160635 -0.3954093 -0.0148496 -0.1193585 -1.4487531 -0.0698018 0.0073103 -0.0837602 -0.6601358 -0.8685351 0.5446788 0.0315928 0.7972946 -1.009049 0.0097544 0.0517475 -0.0026731 -0.6258163 -0.6817175 -0.3065482 -0.0257671 -0.6114128 -1.0277745 -0.0605307 -0.0502893 -0.0453001 -0.6635816 -1.2836398 0.3856114 -0.0387226 -0.3066227 -0.4581085 -0.0602374 -0.094265 -0.0252503 0.0919862 1.6746332 -0.4304837 0.0402484 0.1606573 0.5400277 0.0362456 0.0879296 0.0063107 0.1955886 -1.0793667 -0.133805 -0.0687886 0.8432208 -0.3576678 0.0082482 0.0097878 -0.0410789 0.0667123 1.2510619 0.477117 0.0916871 -0.1440886 1.7008397 0.1138775 0.0418403 0.1449454 0.2032364 0.9581531 -0.7266501 -0.0213756 -0.9409294 1.0618846 0.0203261 -0.0386295 0.0312903 0.220839 2.1911335 0.3265979 0.1378027 0.0242457 1.0824456 0.0904386 0.1133198 0.1057271 -0.0115961 1.9938587 0.0484897 0.093657 0.4812663 1.332422 0.1138669 0.1281311 0.091862 0.225591 0.1031998 0.1016315 0.0114847 0.1191717 0.1181333 0.012701 0.0128262 0.0117944 0.0375696 0.1707944 -0.038987 -0.0135434 -0.0092846 0.3018904 -0.0065917 -0.0111593 -0.0080715 0.3774662 0.1593728 0.0466809 -0.0060939 0.0089013 0.2794328 -0.0056908 -0.0091225 -0.0037521 0.3552913 0.1501372 -0.0527335 -0.0149493 -0.1013211 0.2644795 -0.0131721 -0.0187248 -0.0109869 0.361389 0.4540658 0.0652582 0.0097424 0.0301365 0.3583622 0.0008202 0.0072013 0.0024854 0.366969 0.2919742 0.0867633 0.0034688 0.106049 0.2101505 -0.0065794 0.0050083 -0.0075174 0.3593952 0.2266176 0.0427458 -0.0045707 0.0356967 0.2087749 -0.0123602 -0.005078 -0.0119504 0.3848207 0.1032784 0.0510632 -0.0691764 -0.0358146 -0.0245636 0.0520041 -0.0516914 0.0401249 -0.0147636 0.0900433 0.0421602 0.0878502 -0.0393389 -0.0098561 -0.0560633 0.0568451 -0.0358011 -0.016547 -0.1440229 -0.0777127 -0.0197439 -0.0651434 0.0584335 -0.008903 -0.0187224 -0.0095053 0.1266097 unknown
polarizability: 316.3057443|-4.2760637|187.6580391|12.3478963|9.6875462|65.8083886 unknown
InChI: InChI=1S/C8H9N7OS/c1-17-8-14-5(10)3-7(15-8)13-4(9)2(12-3)6(11)16/h9-11H2,1H3
charge 0 multiplicity 1
26 atoms
S  -4.623198 0.060273 -0.437857
O  4.381711 -0.658836 -0.041416
N  1.174572 1.033767 -0.067188
N  0.181788 -1.639396 -0.332606
N  -2.034991 -0.809403 -0.377859
N  -2.465561 1.607509 -0.204712
N  -0.711752 3.151159 0.007185
N  2.377436 -2.438315 -0.286378
N  3.827829 1.598945 0.111081
C  -0.164376 0.778119 -0.155474
C  -0.677248 -0.573547 -0.290147
C  2.031015 -0.012109 -0.108076
C  -1.136853 1.85891 -0.117697
C  1.520845 -1.379739 -0.243952
C  -2.827965 0.282504 -0.329928
C  3.499621 0.271769 -0.011698
C  -4.728283 -1.807492 -0.59329
H  -1.401716 3.899256 0.03252
H  0.285705 3.342215 0.072338
H  1.981381 -3.372762 -0.382218
H  3.387711 -2.242784 -0.220536
H  3.078664 2.29127 0.128426
H  4.807526 1.866728 0.181601
H  -4.279547 -2.280328 0.291046
H  -4.191468 -2.136712 -1.49353
H  -5.803044 -2.038701 -0.664933
