program: Gaussian 09
title: 000256773
version: EM64L-G09RevD.01
frameworkgroup: C1[X(C18H18N2O3)]
method: RPBEPBE
basis: SDD
operation: Freq
keyword: #p
keyword: freq=noraman
keyword: PBEPBE/SDD
title: #p freq=noraman PBEPBE/SDD
converged: YES YES NO NO
title: Mulliken charges:
elementType: O O O N N C C C C C C C C C C C C C C C C C C H H H H H H H H H H H H H H H H H H
charge: -0.242716 -0.266137 -0.260114 -0.189384 -0.074468 -0.359365 -0.370156 -0.307896 -0.322915 0.470984 -0.365951 -0.371933 -0.383534 -0.350781 0.228800 0.218559 0.495730 0.169806 -0.501019 -0.383162 -0.337390 -0.393785 -0.202862 0.224358 0.212410 0.222701 0.217636 0.194819 0.219662 0.221647 0.193941 0.217954 0.231415 0.249675 0.230380 0.297187 0.230144 0.251240 0.208241 0.237896 0.238384
chargesum: 0.00000
title: Mulliken charges with hydrogens summed into heavy atoms:
elementType: O O O N N C C C C C C C C C C C C C C C C C C
charge: -0.242716 -0.266137 -0.260114 -0.189384 -0.074468 0.077403 0.070180 0.106585 0.092673 0.470984 -0.147997 -0.140518 -0.133859 -0.120402 0.228800 0.218559 0.495730 0.169806 -0.203832 -0.153017 -0.086150 -0.185544 0.273417
polarizability: 5.58963629e+02 9.52983028e+00 2.05404757e+02 -3.83684317e+00 3.08398681e+00 1.11729642e+02
1716.lowfreq: -40.0524 -0.8711 -0.0006 0.0005 0.0010 3.5045 10.8590 21.1149 24.0986
frequency: -40.0416 21.0569 24.0664 37.9699 54.0548 58.0700 93.6825 113.2329 146.3943 196.8526 209.7579 219.5254 224.7210 240.2279 270.9511 323.9753 345.2884 372.8262 387.1594 396.8958 417.1468 432.6975 437.9143 458.0726 476.2872 501.0369 530.3574 539.4590 592.9202 610.7102 622.4039 636.1120 680.1099 698.3436 720.7269 732.1534 764.2795 783.8082 796.1258 808.2105 810.6364 825.6485 837.2886 842.7542 844.5144 907.8764 912.2510 915.1623 929.2645 931.3267 938.8119 956.9488 967.3489 978.7397 991.3377 1019.3184 1044.6310 1054.2502 1056.1884 1066.0462 1083.5907 1102.7325 1119.8277 1123.4592 1126.0248 1163.2972 1172.2287 1187.1045 1200.3388 1219.3927 1235.9038 1256.0601 1260.4632 1266.3531 1284.6881 1307.0785 1333.4354 1340.8147 1348.6246 1360.7978 1363.4344 1365.7494 1369.2592 1378.5123 1404.5339 1438.1751 1444.5553 1452.1225 1452.5073 1454.4360 1461.5520 1474.5949 1487.0670 1506.6917 1548.7134 1569.5550 1605.5760 1622.0165 1627.4820 2912.7501 2924.9209 2945.7778 2952.3967 2957.1444 3013.0771 3053.2715 3083.1847 3085.9238 3087.6172 3090.8694 3126.1662 3134.8122 3144.0175 3160.5013 3167.7668 3181.4598 3186.2595
redmass: 2.3466 5.7209 4.4844 5.3237 4.5961 3.8685 5.5566 6.7167 5.5173 5.6146 3.7914 2.7048 3.8983 3.2288 3.6769 7.1007 4.4520 2.6183 3.2715 4.7705 3.0389 3.6407 3.6963 2.7682 6.6770 4.7840 2.4363 3.9058 4.1247 4.0502 3.7452 6.8278 9.5760 3.7585 4.3170 3.8812 6.6648 5.5643 1.5874 1.8527 1.7455 1.8154 2.8589 5.6966 2.7221 1.4568 2.9809 2.5175 1.3611 2.2581 1.8472 1.3763 1.6168 4.5737 2.6961 2.3393 2.2981 1.9461 3.7376 1.4569 4.7592 2.1669 1.0370 1.4617 1.5480 1.9340 3.0131 1.4996 1.0929 1.8643 1.4631 1.4162 1.3414 2.7781 1.1991 1.3647 1.5658 1.5140 1.4819 1.6634 1.8223 1.6987 1.8821 1.3317 2.9308 3.6785 1.0859 1.1922 1.1109 3.2278 1.1328 2.9678 1.2090 2.7710 6.6829 6.1510 7.5738 8.1192 6.4388 1.0692 1.0712 1.0853 1.0669 1.0668 1.0534 1.0914 1.0960 1.0940 1.0932 1.1189 1.0877 1.0898 1.0866 1.0932 1.0960 1.0951 1.0935
irintensity: 15.3239 0.1919 0.1808 0.4517 1.0962 4.9709 1.3828 4.5418 1.1199 0.5451 12.1070 4.6856 1.4599 3.3610 35.0008 10.1450 5.3064 3.4723 4.1005 9.9472 1.9062 3.9994 4.5225 3.2726 14.0805 4.6748 16.0761 38.1843 17.4134 21.3215 8.9257 0.2175 0.2968 9.2991 4.8453 10.8467 10.8632 21.9743 2.5913 8.2876 42.8004 63.5253 4.6370 29.6188 8.0865 15.9017 94.0256 24.1403 10.2611 16.4969 2.1536 9.3812 16.8054 185.5036 0.5103 21.5632 12.2801 14.7840 18.9092 4.3642 51.5920 27.4722 0.0069 15.8476 23.1619 26.6454 9.2654 11.7701 5.6313 29.0556 508.7999 64.6423 59.2882 175.5734 18.5074 0.6087 11.4930 1.9463 12.4954 32.7294 0.5488 71.4094 41.1045 51.7119 8.8484 10.0129 3.2390 46.1241 49.4912 174.9458 33.2250 78.6083 16.3724 217.3581 5.7870 29.8984 33.7459 4.1872 286.1612 77.5527 113.4526 66.2869 30.2855 113.0916 172.1282 23.9453 37.3522 34.4521 35.9888 32.8466 12.1163 9.2485 15.9903 27.3562 19.9302 7.9330 6.2909
temp: 298.150 k
press: 1.00000 atm
elementType: 8 8 8 7 7 6 6 6 6 6 6 6 6 6 6 6 6 6 6 6 6 6 6 1 1 1 1 1 1 1 1 1 1 1 1 1 1 1 1 1 1
symmnumber: 1
zpe: 852534.2 jmol-1
zpe.correction: 0.324713 hartree
zpe.thermalcorrener: 0.343532 hartree
zpe.thermalcorrenthalpy: 0.344476 hartree
zpe.thermalcorrgfe: 0.275310 hartree
zpe.sumelectzpe: -1030.171846 hartree
zpe.sumelectthermal: -1030.153027 hartree
zpe.sumelectthermalent: -1030.152083 hartree
zpe.sumelectthermalfe: -1030.221249 hartree
dipole: -0.4972 1.0738 -0.2901
dipole: 1.2183
quadrupole: -123.0992 -119.9030 -137.9502
quadrupole: -2.2418 3.5312 1.7529
quadrupole: 3.8850 7.0811 -10.9661 -2.2418 3.5312 1.7529
hfenergy: -1030.496559 hartree
pointgroup: C01 [X(C18H18N2O3)]
dipole: -0.1928252 0.1385662 0.4163711 debye
polarizability: 559.0544549|5.7810403|111.7272196|6.5558693|2.510561|205.3163542 unknown
InChI: InChI=1S/C18H18N2O3/c1-6-17-18(23-13-22-17)11-14(1)12-19-15-2-4-16(5-3-15)20-7-9-21-10-8-20/h1-6,11-12H,7-10,13H2
charge 0 multiplicity 1
41 atoms
O  -7.757162 -0.132995 0.006418
O  5.927559 -0.304891 -1.834133
O  7.277362 0.079948 0.116537
N  -4.860506 0.047969 -0.069749
N  0.853103 0.095101 -0.281494
C  -5.639193 -0.376264 -1.259823
C  -5.56903 -0.209774 1.201325
C  -7.052657 0.228257 -1.233461
C  -6.992899 0.376476 1.153487
C  -3.445097 0.021767 -0.101413
C  -2.725967 0.359723 -1.290676
C  -2.673762 -0.322307 1.052848
C  -1.324175 0.364252 -1.313831
C  -1.268764 -0.289327 1.029475
C  -0.556637 0.067386 -0.152428
C  5.103833 -0.063577 -0.703597
C  3.112157 0.225537 0.615355
C  5.904455 0.162665 0.442624
C  3.716114 -0.041493 -0.657068
C  3.924696 0.451555 1.762072
C  5.341748 0.423403 1.694724
C  1.649859 0.268851 0.749038
C  7.325248 -0.208232 -1.34535
H  -5.720241 -1.486894 -1.284172
H  -5.130675 -0.057559 -2.18311
H  -5.028369 0.28117 2.029346
H  -5.622996 -1.301447 1.419984
H  -6.993251 1.33488 -1.322056
H  -7.666766 -0.178149 -2.053599
H  -7.564207 0.080021 2.048463
H  -6.934584 1.48549 1.099105
H  -3.262812 0.641607 -2.201309
H  -3.169575 -0.658952 1.967897
H  -0.784142 0.62074 -2.231076
H  -0.719528 -0.597768 1.927255
H  3.080844 -0.214969 -1.528467
H  3.441365 0.654297 2.724947
H  5.966155 0.596598 2.57441
H  1.270765 0.482485 1.771329
H  7.831313 0.62917 -1.856228
H  7.83162 -1.176348 -1.500394
