program: Gaussian 09
title: 000256767
version: EM64L-G09RevD.01
frameworkgroup: C1[X(C14H8Cl4N2O2)]
method: RPBEPBE
basis: SDD
operation: Freq
keyword: #p
keyword: freq=noraman
keyword: PBEPBE/SDD
title: #p freq=noraman PBEPBE/SDD
converged: YES YES NO NO
title: Mulliken charges:
elementType: Cl Cl Cl Cl O O N N C C C C C C C C C C C C C C H H H H H H H H
charge: -0.009661 -0.009676 -0.055249 -0.055269 -0.234178 -0.234197 -0.451921 -0.451929 -0.069364 -0.069212 0.307850 0.307927 0.336655 0.336609 -0.367213 -0.367226 -0.281930 -0.281918 -0.059698 -0.059667 -0.249601 -0.249622 0.273999 0.273966 0.312166 0.312164 0.267405 0.267393 0.280702 0.280699
chargesum: 0.00000
title: Mulliken charges with hydrogens summed into heavy atoms:
elementType: Cl Cl Cl Cl O O N N C C C C C C C C C C C C C C
charge: -0.009661 -0.009676 -0.055249 -0.055269 -0.234178 -0.234197 -0.139755 -0.139765 0.204635 0.204754 0.307850 0.307927 0.336655 0.336609 -0.099809 -0.099833 -0.281930 -0.281918 -0.059698 -0.059667 0.031100 0.031076
polarizability: 3.33732776e+02 7.58682396e-03 2.32959561e+02 2.16998247e+01 -9.65754621e-03 8.79657982e+01
1716.lowfreq: -4.8343 -2.2379 -0.7597 0.0017 0.0018 0.0023 6.1295 16.7661 32.3775
frequency: 5.7548 16.7613 32.3775 43.4985 98.0890 122.2953 127.8033 151.8308 153.5692 168.7847 177.6946 206.5582 217.3055 229.7796 257.7905 259.6563 311.8731 316.5738 346.5044 373.2729 375.2540 389.1468 395.8126 420.5131 445.0667 487.8740 503.0870 503.5529 538.3114 558.3592 558.5267 605.6439 615.3571 705.9518 706.7268 708.2068 712.9647 750.2205 768.8677 819.8681 822.3369 825.2456 825.3055 835.7542 835.9525 903.0630 921.7612 943.6614 958.8951 997.5487 1021.4503 1068.1077 1068.8987 1121.4090 1124.1994 1129.6985 1197.1550 1198.2502 1252.7532 1255.8074 1258.9049 1261.8970 1284.7014 1338.2447 1346.9840 1364.0503 1383.9319 1387.0852 1436.5217 1436.7999 1471.8318 1477.5385 1600.8639 1602.1523 1619.0007 1621.1606 3007.1496 3021.2914 3182.5255 3182.5442 3190.2811 3190.2923 3591.1581 3591.4750
redmass: 8.5067 15.0358 16.5889 11.0967 10.6835 13.1599 6.4420 8.6925 15.4250 6.0403 14.0514 1.8807 9.8194 9.0804 2.8813 4.8478 5.8036 9.2797 17.5660 8.2223 13.2587 8.8146 11.3804 4.6575 1.3232 5.2790 5.3599 5.3572 5.9232 4.3354 4.3306 6.6376 6.5155 6.5868 5.7329 7.0241 9.5374 6.7310 6.2994 6.7765 5.9989 1.3979 1.3959 1.4411 1.4325 9.5749 6.7176 5.5384 5.6287 4.0548 2.7349 2.1274 2.0838 2.8425 2.9677 3.2221 1.4918 1.4832 1.5213 1.9651 1.4256 2.1288 1.6601 1.7080 1.7140 1.4590 6.2510 6.3154 2.9251 2.8916 6.2486 6.8257 7.8881 7.8107 9.7909 9.8804 1.0868 1.0911 1.0937 1.0937 1.0931 1.0931 1.0794 1.0792
irintensity: 4.4488 0.2828 0.0532 0.0015 1.8769 0.0203 25.2150 9.1195 0.6074 0.3638 2.5947 167.5891 0.1708 0.2166 140.3647 0.3352 10.3634 0.0005 5.1876 7.2058 0.0046 10.2224 7.3540 70.8929 60.1037 22.9474 1.4091 0.0067 1.0692 1.7061 26.6929 5.2330 17.1955 44.6389 0.2197 29.9224 64.8279 30.4416 4.5777 11.1651 31.4854 6.1472 39.7651 5.2138 72.2728 54.1097 10.2896 175.7442 51.8523 3.2228 191.5541 1.2796 1.1758 1.6644 113.2405 1.4778 59.5398 1.9697 0.4892 137.9694 8.8225 0.0438 397.4291 31.8851 120.4303 7.5720 137.4291 0.0696 0.8310 61.1789 461.2008 0.0227 86.2702 85.5185 112.7900 56.4428 0.3279 107.0533 1.3712 0.1450 3.6893 1.9845 44.5766 49.5789
temp: 298.150 k
press: 1.00000 atm
elementType: 17 17 17 17 8 8 7 7 6 6 6 6 6 6 6 6 6 6 6 6 6 6 1 1 1 1 1 1 1 1
symmnumber: 1
zpe: 504481.5 jmol-1
zpe.correction: 0.192147 hartree
zpe.thermalcorrener: 0.211879 hartree
zpe.thermalcorrenthalpy: 0.212824 hartree
zpe.thermalcorrgfe: 0.139616 hartree
zpe.sumelectzpe: -2636.893791 hartree
zpe.sumelectthermal: -2636.874059 hartree
zpe.sumelectthermalent: -2636.873115 hartree
zpe.sumelectthermalfe: -2636.946322 hartree
dipole: -0.0024 -4.9703 0.0029
dipole: 4.9703
quadrupole: -181.0387 -153.4814 -151.8250
quadrupole: 0.0028 -0.9621 -0.0090
quadrupole: -18.9237 8.6337 10.2900 0.0028 -0.9621 -0.0090
hfenergy: -2637.0859383 hartree
pointgroup: C01 [X(C14H8Cl4N2O2)]
dipole: 0.0009728 1.9554386 -0.0064664 debye
polarizability: 335.2247996|-0.036813|232.9573972|-10.0977705|-0.5630803|86.4759392 unknown
InChI: InChI=1S/C14H8Cl4N2O2/c15-5-1-7(17)11-9(3-5)19-13(21-11)14-20-10-4-6(16)2-8(18)12(10)22-14/h1-4,13-14,19-20H
charge 0 multiplicity 1
30 atoms
Cl 4.007289 -3.282782 0.038897
Cl -4.007797 -3.282646 -0.014518
Cl 6.583649 1.659193 0.181697
Cl -6.583752 1.658224 -0.197003
O  1.44338 -1.409628 0.476286
O  -1.443411 -1.412999 -0.464259
N  1.306725 0.940811 0.636912
N  -1.306527 0.936085 -0.642621
C  0.4734 -0.2796 0.616146
C  -0.473294 -0.284194 -0.612541
C  2.66457 0.585229 0.479096
C  -2.664497 0.581825 -0.483222
C  2.724682 -0.828522 0.354641
C  -2.724799 -0.83094 -0.348106
C  3.825401 1.37313 0.430269
C  -3.825314 1.370147 -0.441234
C  3.942934 -1.482684 0.178756
C  -3.943215 -1.483679 -0.168164
C  5.048008 0.679128 0.252852
C  -5.048096 0.677571 -0.259511
C  5.138538 -0.717976 0.121229
C  -5.138822 -0.718489 -0.117388
H  -0.117761 -0.435782 1.538868
H  0.117928 -0.447387 -1.53403
H  1.012829 1.743464 1.191224
H  -1.012033 1.73491 -1.202105
H  3.801569 2.461376 0.519198
H  -3.801354 2.457688 -0.53838
H  6.101512 -1.212609 -0.022087
H  -6.101942 -1.211965 0.028897
