program: Gaussian 09
title: 000256763
version: EM64L-G09RevD.01
frameworkgroup: C1[X(C16H16N2O2)]
method: RPBEPBE
basis: SDD
operation: Freq
keyword: #p
keyword: freq=noraman
keyword: PBEPBE/SDD
title: #p freq=noraman PBEPBE/SDD
converged: YES YES NO NO
title: Mulliken charges:
elementType: O O N N C C C C C C C C C C C C C C C C H H H H H H H H H H H H H H H H
charge: -0.300137 -0.300104 -0.455826 -0.455891 0.272358 0.272450 -0.742518 -0.742564 0.265237 0.265300 0.206238 0.206137 -0.371028 -0.371044 -0.379160 -0.379127 -0.216872 -0.216868 -0.231779 -0.231778 0.301690 0.301693 0.256824 0.234767 0.239160 0.239158 0.234795 0.256834 0.231858 0.231858 0.242753 0.242753 0.221286 0.221287 0.225130 0.225131
chargesum: 0.00000
title: Mulliken charges with hydrogens summed into heavy atoms:
elementType: O O N N C C C C C C C C C C C C C C C C
charge: -0.300137 -0.300104 -0.154137 -0.154199 0.272358 0.272450 -0.011767 -0.011777 0.265237 0.265300 0.206238 0.206137 -0.139170 -0.139186 -0.136407 -0.136374 0.004414 0.004419 -0.006649 -0.006647
polarizability: 3.02117587e+02 7.05560056e+00 1.74690760e+02 2.14386578e+01 -1.46679659e-01 1.05597347e+02
1716.lowfreq: -4.5624 -0.0007 -0.0001 0.0003 6.8879 11.1835 19.4907 24.6100 48.1748
frequency: 19.4907 24.6100 48.1440 97.3050 152.1133 204.1299 207.4070 213.2883 218.9141 240.8000 252.4579 257.2864 259.2196 274.4288 279.9688 334.9023 336.6256 362.8216 413.4759 415.2992 440.7706 475.7108 548.7503 552.4061 553.3818 555.5654 561.5898 600.3490 600.5033 616.9106 704.0875 719.1698 719.4731 737.3879 737.8020 761.5652 768.5902 784.5012 833.6316 835.2808 835.6202 858.0445 859.1781 877.9516 903.4160 903.5027 916.6086 940.4752 951.8307 951.8494 1011.2045 1011.4071 1045.0619 1062.0557 1096.1720 1115.1375 1117.3465 1139.5092 1160.0511 1165.0026 1170.3939 1175.9903 1203.7446 1250.4839 1260.7845 1263.6497 1268.7348 1274.5495 1352.8575 1354.8000 1376.5060 1377.9678 1426.2892 1426.8580 1452.0550 1452.4639 1453.6974 1454.8791 1470.3425 1476.2657 1483.9758 1488.8391 1611.4549 1613.0391 1627.4945 1627.9787 3002.0719 3002.6120 3101.1930 3101.9550 3119.7463 3120.1850 3133.1611 3133.1708 3148.0497 3148.0581 3161.1981 3161.2009 3175.8128 3175.8643 3608.2129 3608.2465
redmass: 4.7181 5.4796 5.1235 3.9507 3.6510 1.1065 1.2755 3.8122 2.6934 2.5289 1.6998 2.6747 1.8549 2.1321 3.0651 4.0324 3.4384 3.8607 3.0310 3.0588 3.6114 5.4926 4.7264 5.0399 5.1757 4.3163 4.3574 6.3503 6.9157 4.8396 4.2368 4.9301 4.9278 1.2128 1.2116 6.7815 6.4255 4.7043 2.5356 1.3606 1.6510 5.2326 4.7432 2.4886 1.3804 1.3803 2.3389 1.7184 1.2803 1.2801 2.0390 2.0341 2.5242 2.6701 1.9157 1.5552 2.3718 2.1853 1.5690 1.1391 1.5923 3.2527 4.1025 3.6748 1.4566 1.5343 2.4653 2.4613 1.8926 1.9870 1.2283 1.2487 3.3038 3.2689 1.2323 1.1613 1.8163 1.9954 1.0763 1.0920 4.2528 4.5375 7.2488 7.0189 7.9370 7.8275 1.0356 1.0355 1.1001 1.0999 1.1000 1.1000 1.0853 1.0853 1.0907 1.0907 1.0955 1.0954 1.0991 1.0991 1.0792 1.0793
irintensity: 2.7095 1.1694 0.0000 3.6247 0.0000 0.0013 0.9042 0.0008 24.2010 32.9266 0.0008 0.0031 94.2058 123.7343 0.0001 0.0142 81.6557 0.0000 10.2751 0.0000 6.3973 45.4759 4.7725 0.0000 0.0000 0.0000 5.2405 0.0003 3.6775 0.0000 16.5104 0.1298 0.0000 0.0001 237.8892 0.0000 10.5310 0.0000 70.1427 0.0021 19.8893 0.0000 6.7681 0.0000 0.0117 12.0994 3.0520 0.0000 0.0832 0.0003 47.6727 0.0016 87.1934 0.0000 26.9999 0.0001 166.4384 17.1643 0.0001 51.1501 0.0002 266.0394 0.0000 0.0000 64.4970 0.0000 158.1737 0.0000 467.6628 0.0006 51.3018 0.0003 0.4469 0.0000 0.0180 34.1252 0.0009 19.6313 11.2567 0.0003 547.8238 0.0000 0.0001 68.1182 19.1885 0.0004 16.9891 0.0000 0.0065 35.8304 0.0297 24.6899 0.0005 4.6419 31.0728 1.1043 41.4584 8.4974 23.9537 0.0147 0.0096 87.5797
temp: 298.150 k
press: 1.00000 atm
elementType: 8 8 7 7 6 6 6 6 6 6 6 6 6 6 6 6 6 6 6 6 1 1 1 1 1 1 1 1 1 1 1 1 1 1 1 1
symmnumber: 1
zpe: 747297.4 jmol-1
zpe.correction: 0.284631 hartree
zpe.thermalcorrener: 0.302040 hartree
zpe.thermalcorrenthalpy: 0.302984 hartree
zpe.thermalcorrgfe: 0.239214 hartree
zpe.sumelectzpe: -877.815321 hartree
zpe.sumelectthermal: -877.797912 hartree
zpe.sumelectthermalent: -877.796968 hartree
zpe.sumelectthermalfe: -877.860738 hartree
dipole: 0.0010 -0.0012 0.0014
dipole: 0.0021
quadrupole: -115.7317 -104.7819 -120.8850
quadrupole: -4.2403 1.5182 3.7711
quadrupole: -1.9322 9.0177 -7.0854 -4.2403 1.5182 3.7711
hfenergy: -878.0999517 hartree
pointgroup: C01 [X(C16H16N2O2)]
dipole: 0.0003899 -0.0004981 0.0005566 debye
polarizability: 301.989628|5.6627509|174.5687343|22.5335645|1.7668291|105.8473324 unknown
InChI: InChI=1S/C16H16N2O2/c1-15(17-11-7-3-5-9-13(11)19-15)16(2)18-12-8-4-6-10-14(12)20-16/h3-10,17-18H,1-2H3
charge 0 multiplicity 1
36 atoms
O  -1.452741 -1.145278 0.3431
O  1.452214 1.144898 -0.34384
N  -1.460805 1.201456 0.306088
N  1.461333 -1.201808 -0.305454
C  -0.558544 0.05339 0.552588
C  0.558548 -0.054299 -0.552586
C  0.005779 0.02044 1.97626
C  -0.005848 -0.022447 -1.976254
C  -2.785394 0.762407 0.143008
C  2.785738 -0.762066 -0.142741
C  -2.774365 -0.65845 0.150271
C  2.774075 0.658782 -0.150846
C  -3.994588 1.4576 -0.033499
C  3.995256 -1.456611 0.034096
C  -3.926911 -1.425676 -0.009209
C  3.926288 1.42662 0.008093
C  -5.182327 0.690048 -0.199048
C  5.182664 -0.688429 0.199096
C  -5.154294 -0.721993 -0.190155
C  5.153999 0.723593 0.189364
H  -1.195171 2.131372 0.622489
H  1.196074 -2.132042 -0.621232
H  0.616844 -0.883944 2.122498
H  0.640186 0.905921 2.156343
H  -0.827526 0.017357 2.69867
H  0.827427 -0.019465 -2.698699
H  -0.639893 -0.908306 -2.155769
H  -0.617302 0.881584 -2.123025
H  -4.027732 2.551775 -0.047373
H  4.02889 -2.550763 0.048627
H  -3.887621 -2.518494 0.009159
H  3.886506 2.519409 -0.010915
H  -6.135789 1.211292 -0.337834
H  6.136369 -1.209164 0.338125
H  -6.081781 -1.288681 -0.321076
H  6.081242 1.290774 0.319884
