program: Gaussian 09
title: 000256761
version: EM64L-G09RevD.01
frameworkgroup: C1[X(C6H12N2S2)]
method: RPBEPBE
basis: SDD
operation: Freq
keyword: #p
keyword: freq=noraman
keyword: PBEPBE/SDD
title: #p freq=noraman PBEPBE/SDD
converged: NO YES NO NO
title: Mulliken charges:
elementType: S S N N C C C C C C H H H H H H H H H H H H
charge: 0.073908 0.187883 -0.216777 -0.303032 -0.345331 -0.440258 -0.395398 -0.344583 -0.664481 -0.642778 0.318372 0.255112 0.271728 0.291649 0.241951 0.242373 0.203973 0.232248 0.260190 0.250589 0.274117 0.248547
chargesum: 0.00000
title: Mulliken charges with hydrogens summed into heavy atoms:
elementType: S S N N C C C C C C
charge: 0.073908 0.187883 0.054951 -0.011383 -0.026960 -0.185146 0.088926 0.091638 -0.153703 -0.120114
polarizability: 1.51478035e+02 -2.70941920e-01 1.11228635e+02 -5.92993861e+00 -1.57216117e+00 7.47360759e+01
1716.lowfreq: -12.7121 -0.0019 0.0024 0.0033 3.7344 9.7477 60.5411 62.7748 95.7609
frequency: 59.9852 62.7507 95.7179 120.7715 206.0029 231.7672 273.4572 316.5513 396.8789 439.2766 452.2710 509.9439 515.7973 563.6066 630.9339 647.2187 660.5990 721.0639 747.4942 868.6979 888.1915 916.5347 934.1997 965.2094 999.0176 1016.9718 1036.9714 1078.3797 1121.9605 1145.2245 1153.6570 1162.0994 1167.2228 1183.6774 1192.4870 1222.1539 1258.8004 1270.2571 1294.6709 1323.2466 1333.0772 1376.7155 1400.4742 1446.0530 1452.6747 1465.8061 1467.7630 1474.0477 2885.8188 2894.6818 3017.5392 3025.8377 3035.9419 3051.0282 3083.4318 3100.5766 3107.6278 3128.1709 3426.5521 3481.7895
redmass: 5.0120 3.2008 3.3677 4.8860 11.3457 2.3220 2.0765 5.6920 2.0770 2.6069 2.9583 4.0244 3.9425 4.1122 3.0658 3.3240 4.1126 1.8479 2.6950 1.5798 1.7192 2.9928 2.6327 1.8274 1.8263 1.4252 1.6569 2.9935 1.4915 1.3075 1.3867 1.6555 1.5244 1.7219 1.3722 1.5169 1.2504 1.2031 1.3345 1.2638 1.2804 1.4202 1.3698 1.0998 1.1013 1.1452 1.1569 1.0930 1.0823 1.0709 1.0589 1.0596 1.0819 1.0648 1.1049 1.0891 1.1086 1.1104 1.0743 1.0757
irintensity: 1.5612 4.1523 0.1077 4.2525 2.5998 0.7523 2.1682 7.3372 2.0025 106.8263 50.6240 4.7232 23.0928 26.9156 15.2965 6.0053 5.0696 152.6846 31.0562 2.9392 10.3888 5.8757 7.1106 7.2053 3.2594 13.2122 2.1764 2.2718 8.3757 11.1103 17.6652 21.8857 1.6300 13.1728 4.4659 9.6489 23.1897 18.4782 1.3689 22.8477 21.7424 1.7476 44.6330 6.4477 10.4617 20.6905 13.0407 2.4093 61.3917 131.6276 36.6787 49.5753 13.0798 52.9860 17.1347 4.5338 26.3444 17.9666 2.3187 3.8977
temp: 298.150 k
press: 1.00000 atm
elementType: 16 16 7 7 6 6 6 6 6 6 1 1 1 1 1 1 1 1 1 1 1 1
symmnumber: 1
zpe: 475559.4 jmol-1
zpe.correction: 0.181131 hartree
zpe.thermalcorrener: 0.191652 hartree
zpe.thermalcorrenthalpy: 0.192596 hartree
zpe.thermalcorrgfe: 0.144100 hartree
zpe.sumelectzpe: -1140.639093 hartree
zpe.sumelectthermal: -1140.628572 hartree
zpe.sumelectthermalent: -1140.627628 hartree
zpe.sumelectthermalfe: -1140.676125 hartree
dipole: -0.3393 0.4263 1.6095
dipole: 1.6992
quadrupole: -62.4660 -81.0988 -75.1859
quadrupole: 10.3281 -1.8244 0.1275
quadrupole: 10.4509 -8.1819 -2.2690 10.3281 -1.8244 0.1275
hfenergy: -1140.8202241 hartree
pointgroup: C01 [X(C6H12N2S2)]
dipole: 0.1077417 -0.1995157 0.6288884 debye
dipolederiv: -0.4186361 0.2238006 0.0009714 0.1044988 -0.5763533 -0.0049359 0.0140743 0.061496 -0.2233341 -0.3546038 0.0867338 -0.0249049 0.1266892 -0.1740608 0.0184557 -0.0249927 0.001351 -0.1786527 -0.5954395 -0.0624189 0.012503 0.0965147 -0.9920273 -0.086231 0.0566611 -0.0292539 -0.1088639 -0.7538811 0.0078315 0.076504 -0.0559161 -0.4158468 -0.1042662 0.0426499 -0.1071279 -0.5670803 0.4469607 -0.1166607 0.0620497 -0.2532724 0.9320929 0.0078344 0.0976979 0.0776858 0.1514297 0.5884715 -0.1306572 0.1131706 -0.028191 0.3992103 0.0052383 0.0310022 0.0306675 0.3963775 0.2950322 -0.0502276 -0.0386722 -0.0256649 0.3728787 0.0217521 -0.1986628 -0.1288022 0.2339882 0.4594052 -0.0039155 -0.1423663 -0.1018624 0.1322928 0.0551481 -0.1464194 -0.0468391 0.3960458 0.1829122 -0.0158632 0.0526672 0.193696 -0.1339412 0.0642874 0.1583024 0.0512252 0.1371523 0.2441377 0.0605311 0.0435235 0.1943462 -0.0195619 0.0987787 0.1258059 0.0854732 0.1326041 0.0128447 0.0530664 -0.0212104 0.0473844 -0.0381032 0.0305407 -0.0141217 0.0057559 -0.0429453 -0.0895386 0.0067712 -0.1003112 -0.0014403 -0.0538882 0.0017055 -0.1161957 -0.0374977 -0.196888 0.1618859 -0.0356392 0.0210833 -0.0322884 0.2811361 0.1080555 0.0189937 -0.0147344 -0.0083016 0.2044381 0.0517004 -0.0367334 0.0479429 0.0867829 0.0423972 -0.101459 0.1267244 0.28624 -0.0309281 -0.0765726 -0.0333334 -0.1431249 -0.0380055 -0.0569152 -0.084915 -0.075062 0.0576101 0.0485845 0.0160678 -0.0103392 0.0351864 0.0517568 0.0082914 0.0773097 0.058874 -0.1269098 -0.0912525 -0.0086555 0.0528312 0.0571147 0.0471412 -0.0203321 0.1940572 0.0566577 -0.2373854 -0.0141077 -0.0760177 -0.0272002 -0.1562528 -0.073459 -0.0574712 -0.0377114 -0.0763496 0.0532573 -0.1390592 0.0562992 0.0587476 0.0328848 0.079141 -0.0365784 0.064513 -0.0356885 0.045508 -0.0238978 -0.0160115 -0.0631033 -0.072004 0.0356013 -0.0233165 -0.1232482 0.0237134 -0.1420284 0.0146598 -0.0351729 -0.0304853 -0.0823537 0.0326016 -0.0406303 -0.0864173 -0.000224 -0.1238972 -0.147988 0.0650106 0.0346082 0.0161128 0.0646118 -0.0318081 0.0530758 -0.0280448 0.0660737 unknown
polarizability: 150.6359346|-5.7929632|111.9750027|6.1804187|1.6441213|74.8318083 unknown
InChI: InChI=1S/C6H12N2S2/c1-3-9-5(7-1)6-8-2-4-10-6/h5-8H,1-4H2
charge 0 multiplicity 1
22 atoms
S  1.648885 -1.604458 -0.166878
S  -1.791871 1.601155 0.082994
N  1.537129 1.156317 0.209511
N  -1.481472 -1.070801 -0.038448
C  0.643859 0.163261 -0.32422
C  -0.676634 0.058903 0.427129
C  2.931964 0.839907 -0.157341
C  -2.918538 -0.886097 0.228741
C  3.225319 -0.643667 0.239584
C  -3.265254 0.486764 -0.377534
H  0.485575 0.264477 -1.407053
H  -0.48531 0.069914 1.526823
H  1.421801 1.275449 1.226771
H  -1.082929 -1.987728 0.195796
H  3.624839 1.539573 0.341426
H  3.045551 0.95385 -1.24996
H  -3.176864 -0.88379 1.31477
H  -3.49123 -1.693121 -0.263604
H  4.051938 -1.066248 -0.353997
H  3.450713 -0.739571 1.315088
H  -3.339344 0.437547 -1.473939
H  -4.176228 0.924565 0.059641
