program: Gaussian 09
title: 000256760
version: EM64L-G09RevD.01
frameworkgroup: C1[X(C20H15NOS)]
method: RPBEPBE
basis: SDD
operation: Freq
keyword: #p
keyword: freq=noraman
keyword: PBEPBE/SDD
title: #p freq=noraman PBEPBE/SDD
converged: YES YES NO NO
title: Mulliken charges:
elementType: S O N C C C C C C C C C C C C C C C C C C C C H H H H H H H H H H H H H H H
charge: 0.225345 -0.408759 -0.044097 -0.449328 0.031099 0.527247 0.276820 -0.326310 0.307223 -0.377593 -0.354413 -0.257868 -0.340826 -0.371546 -0.353677 -0.236108 -0.224264 -0.234889 -0.222663 -0.240176 -0.248553 -0.233120 -0.233554 0.259037 0.270777 0.371337 0.244680 0.272694 0.269937 0.261625 0.228771 0.227946 0.231435 0.232381 0.230025 0.229654 0.229028 0.230683
chargesum: 0.00000
title: Mulliken charges with hydrogens summed into heavy atoms:
elementType: S O N C C C C C C C C C C C C C C C C C C C C
charge: 0.225345 -0.037421 -0.044097 -0.449328 0.031099 0.527247 0.276820 -0.326310 0.307223 -0.118556 -0.083636 -0.013188 -0.068133 -0.101609 -0.092052 -0.007337 0.003682 -0.003454 0.009718 -0.010151 -0.018899 -0.004092 -0.002871
polarizability: 3.43738725e+02 2.15661655e+01 2.52964914e+02 4.56270266e+00 1.97379172e+01 1.82153912e+02
1716.lowfreq: -6.5997 -1.4494 0.0006 0.0007 0.0008 6.2748 19.7521 37.8639 49.3613
frequency: 19.7115 37.7668 49.3583 51.5108 75.4532 94.1381 133.6320 171.1999 192.5105 214.6490 245.8647 262.5239 268.6229 287.7310 313.2070 337.9161 363.2186 383.8991 401.9809 403.3528 421.9454 438.0904 451.6150 474.4272 516.6834 544.8880 554.7003 573.8712 614.8016 615.1857 634.5958 655.5404 665.2156 686.4299 693.9783 699.6947 725.3049 735.0082 768.1747 772.6775 791.1318 834.7720 851.2958 852.7509 855.3115 869.7707 931.6605 933.7846 951.5794 979.8265 981.9064 984.0882 986.4744 989.0623 989.4777 998.9151 999.5325 1025.6102 1026.3925 1028.8018 1047.6226 1056.3940 1087.0956 1101.5749 1118.9432 1160.5395 1168.5555 1172.6150 1174.2580 1193.7660 1195.8848 1199.3195 1245.9554 1277.4527 1315.1106 1325.0011 1332.3958 1368.5702 1381.8259 1383.7287 1424.5066 1433.8062 1437.2934 1442.4914 1479.4596 1481.1433 1535.3016 1559.9108 1580.5432 1590.5496 1596.8024 1607.3753 1610.0200 3126.8939 3127.1366 3131.8697 3138.1198 3139.1988 3143.0353 3152.1632 3155.0312 3156.7609 3163.5915 3167.2584 3171.0640 3173.5407 3178.9121 3548.4587
redmass: 5.4587 3.9649 5.0936 4.0398 5.2134 4.7562 6.0103 5.4227 5.3893 5.8523 6.4116 4.9673 4.4578 4.3323 5.5886 6.7152 4.6565 1.5280 2.8235 2.7957 4.8903 5.9498 4.3610 4.1568 4.2237 5.9031 4.5089 6.5168 6.4337 6.4347 6.0110 7.0480 6.6664 5.2071 1.8873 1.8349 3.5108 2.6053 1.4860 1.9585 2.5606 5.5118 1.5091 1.7930 1.7115 1.4185 1.4457 1.4364 1.3875 1.6449 1.4145 1.3518 3.7082 5.3684 5.8491 1.3223 1.3380 2.7112 2.7101 2.2284 3.4383 3.1241 1.6248 1.8768 1.6630 1.9697 1.0889 1.0608 1.0627 1.1450 1.2169 2.6750 1.8368 2.3295 1.5701 1.3367 1.5847 8.2123 8.0987 8.9477 2.2153 2.3112 2.2670 2.5434 2.2564 2.2417 9.7976 6.3377 5.8927 6.1533 6.7199 6.0539 6.0221 1.0852 1.0850 1.0855 1.0889 1.0896 1.0900 1.0933 1.0946 1.0948 1.0968 1.0968 1.1005 1.0984 1.0968 1.0654
irintensity: 0.0177 0.1031 0.5278 0.3044 0.6774 0.4529 1.2580 0.9618 1.1616 4.2139 0.0622 6.0049 3.0713 9.0915 4.5185 1.4576 6.8560 115.6851 0.2667 2.5027 8.5756 5.0084 15.9187 5.9890 5.1877 16.3491 14.5445 21.2860 1.1378 0.2097 19.0494 2.8433 12.9774 10.6885 43.7599 43.6509 33.8674 47.4276 61.8786 47.7869 3.2255 4.1180 14.0688 12.3165 12.2634 2.7922 0.7834 4.6567 3.6885 18.8782 0.6682 0.4021 28.8166 8.7335 7.8445 0.4867 1.1428 38.0242 14.4561 8.6374 17.6809 15.6895 5.2151 9.0870 0.8228 55.7365 0.2623 1.4483 0.6076 7.3995 19.8627 8.9963 31.8410 29.7452 16.2928 0.2460 51.0650 4.4463 0.4465 0.5656 10.9472 18.8426 10.6626 22.2712 5.0607 10.1496 18.8303 2.9961 1.2258 0.5027 16.4267 1.8966 0.3592 0.1793 0.5369 0.0429 10.9949 14.1215 6.5953 24.6508 30.4462 18.1811 16.6223 21.3548 30.7978 11.0547 8.5406 23.0890
temp: 298.150 k
press: 1.00000 atm
elementType: 16 8 7 6 6 6 6 6 6 6 6 6 6 6 6 6 6 6 6 6 6 6 6 1 1 1 1 1 1 1 1 1 1 1 1 1 1 1
symmnumber: 1
zpe: 760657.9 jmol-1
zpe.correction: 0.289719 hartree
zpe.thermalcorrener: 0.308440 hartree
zpe.thermalcorrenthalpy: 0.309384 hartree
zpe.thermalcorrgfe: 0.241680 hartree
zpe.sumelectzpe: -1297.580002 hartree
zpe.sumelectthermal: -1297.561281 hartree
zpe.sumelectthermalent: -1297.560337 hartree
zpe.sumelectthermalfe: -1297.628041 hartree
dipole: 0.2539 0.0849 -0.6487
dipole: 0.7017
quadrupole: -123.6040 -130.7090 -136.7898
quadrupole: -0.1521 3.3480 0.5748
quadrupole: 6.7636 -0.3414 -6.4222 -0.1521 3.3480 0.5748
hfenergy: -1297.8697211 hartree
pointgroup: C01 [X(C20H15N1O1S1)]
dipole: -0.097035 0.0515645 0.2532721 debye
polarizability: 338.87974|-29.4995359|256.2988949|4.1713698|-22.7686284|183.6789156 unknown
InChI: InChI=1S/C20H15NOS/c22-20(16-11-5-2-6-12-16)19(15-9-3-1-4-10-15)21-17-13-7-8-14-18(17)23-20/h1-14,22H
charge 0 multiplicity 1
38 atoms
S  1.493367 -0.17166 -2.055698
O  -0.903169 1.060988 -2.117048
N  0.027599 -1.5137 0.384595
C  -0.042084 0.577519 -1.05907
C  -0.665384 -0.581335 -0.240197
C  0.404432 1.773989 -0.237611
C  -2.153016 -0.633334 -0.095754
C  2.241278 -1.188853 -0.752857
C  1.422987 -1.69051 0.305796
C  0.672257 1.65982 1.149248
C  0.578009 3.028311 -0.880486
C  3.612518 -1.524922 -0.818933
C  -2.975167 0.527518 -0.170182
C  -2.763807 -1.889102 0.185079
C  2.026454 -2.504868 1.305204
C  1.112255 2.78537 1.881955
C  1.010175 4.149371 -0.144225
C  4.190501 -2.334019 0.183489
C  3.397543 -2.816083 1.255252
C  1.283054 4.031952 1.240397
C  -4.368567 0.426499 0.03239
C  -4.155813 -1.986206 0.373991
C  -4.966073 -0.826985 0.298083
H  0.532038 0.703444 1.662777
H  0.363346 3.111807 -1.949709
H  -1.279655 0.288796 -2.613721
H  4.228297 -1.137985 -1.638101
H  -2.527152 1.503997 -0.370523
H  -2.120283 -2.771098 0.257804
H  1.380327 -2.884714 2.102908
H  1.316845 2.686634 2.953677
H  1.137294 5.114224 -0.647794
H  5.256563 -2.58022 0.13129
H  3.847264 -3.439172 2.035318
H  1.622736 4.903656 1.810919
H  -4.987867 1.328928 -0.016573
H  -4.611129 -2.961205 0.580532
H  -6.049376 -0.900951 0.446174
