program: Gaussian 09
title: 000023196
version: EM64L-G09RevD.01
frameworkgroup: C1[X(C9H18O2)]
method: RPBEPBE
basis: SDD
operation: Freq
keyword: #pfreq=noraman
keyword: PBEPBE/SDD
title: #p freq=noraman PBEPBE/SDD
converged: YES YES NO NO
title: Mulliken charges:
elementType: O O C C C C C C C C C H H H H H H H H H H H H H H H H H H
charge: -0.296760 -0.433017 0.401838 -0.545285 -0.149184 -0.013514 -0.421414 -0.770316 -0.372471 -0.720612 -0.691647 0.231204 0.241436 0.210971 0.202458 0.211371 0.204694 0.211390 0.229148 0.219823 0.209687 0.206069 0.241080 0.195427 0.221634 0.336401 0.211557 0.212272 0.215760
chargesum: 0.00000
title: Mulliken charges with hydrogens summed into heavy atoms:
elementType: O O C C C C C C C C C
charge: -0.296760 -0.096615 0.401838 -0.072645 0.061787 0.188945 -0.005349 -0.109955 0.043284 -0.062472 -0.052058
polarizability: 1.23101582e+02 3.30502318e-02 9.33609539e+01 -4.05560971e+00 -1.30662236e+00 9.14904728e+01
1716.lowfreq: -20.8191 -12.0447 -0.0005 0.0005 0.0005 17.9603 31.3202 70.9938 92.2648
frequency: 30.7361 70.8530 92.2280 95.1584 163.1134 201.0928 213.6897 228.0584 230.5374 288.1234 293.0585 299.1749 315.9133 331.1428 341.0269 448.1917 472.4045 518.6949 533.4676 623.9030 747.2380 753.5164 814.1431 832.9846 866.9803 902.3232 905.9272 925.4854 961.9412 1002.3760 1010.1589 1025.9929 1047.9258 1066.0892 1072.1317 1089.0849 1123.9858 1137.9607 1164.9837 1205.5920 1228.8054 1244.1947 1255.4164 1271.6855 1279.5287 1284.8432 1304.8292 1317.7898 1344.4198 1371.5729 1373.1722 1380.9105 1388.3168 1388.9737 1456.1089 1458.0463 1462.0960 1470.6653 1475.2555 1475.6713 1477.4817 1478.3366 1487.5165 2933.6359 2962.5341 2968.3647 2973.4267 2976.7344 2980.6024 2983.8163 3013.6013 3014.4833 3040.7749 3071.4420 3072.1658 3074.4362 3081.2782 3084.1622 3089.3749 3094.2157 3562.5526
redmass: 3.3988 2.7559 1.9282 2.3307 2.8253 1.0767 1.0813 2.2685 1.2923 1.1598 2.6479 2.8981 2.5032 2.2699 3.7336 2.5738 2.7895 2.8757 5.0615 3.8922 1.1051 3.9034 2.2860 2.3472 1.2821 2.1444 2.4626 1.4995 1.8933 2.1070 1.6961 2.5798 1.8863 1.9157 2.2171 1.9747 2.2040 1.9759 1.8561 1.8239 1.4562 1.5971 1.3549 1.3370 1.3350 1.4214 1.2875 1.5679 1.5433 1.4992 1.3983 1.2688 1.2979 1.2382 1.0650 1.0581 1.0576 1.0735 1.0509 1.0483 1.0709 1.0476 1.0832 1.0822 1.0864 1.0569 1.0382 1.0599 1.0368 1.0358 1.0932 1.0666 1.1025 1.1010 1.0994 1.0978 1.0994 1.1019 1.1007 1.0998 1.0662
irintensity: 0.9000 0.8715 0.0497 0.6309 0.9134 0.1374 0.3740 1.4025 0.1472 128.2516 19.2866 1.2527 5.5647 2.2922 15.0305 3.5174 14.0175 3.8472 1.1567 3.7326 7.2487 11.2478 1.6803 1.8403 0.4651 42.3634 30.1780 2.9950 5.8581 2.5006 20.1088 109.2409 2.0996 2.2854 50.9616 0.9019 23.0040 1.9354 2.8620 4.4405 31.6773 4.2089 6.2121 3.8254 12.4068 36.5498 3.3318 18.5798 2.1486 6.3847 11.6665 16.6274 12.8331 20.4296 5.6119 5.5659 8.6666 9.5338 3.6822 10.3100 7.8031 9.4680 14.0311 20.0854 62.5678 3.7701 43.6879 52.9040 31.6297 19.2184 2.7705 13.7014 27.9064 70.1949 47.1926 38.7641 35.1977 25.8283 31.8944 34.7558 3.1002
temp: 298.150 k
press: 1.00000 atm
elementType: 8 8 6 6 6 6 6 6 6 6 6 1 1 1 1 1 1 1 1 1 1 1 1 1 1 1 1 1 1
symmnumber: 1
zpe: 670510.7 jmol-1
zpe.correction: 0.255384 hartree
zpe.thermalcorrener: 0.268728 hartree
zpe.thermalcorrenthalpy: 0.269672 hartree
zpe.thermalcorrgfe: 0.215803 hartree
zpe.sumelectzpe: -503.276652 hartree
zpe.sumelectthermal: -503.263308 hartree
zpe.sumelectthermalent: -503.262364 hartree
zpe.sumelectthermalfe: -503.316233 hartree
dipole: 0.8065 0.1252 0.5329
dipole: 0.9747
quadrupole: -59.1977 -77.0024 -68.3174
quadrupole: 0.5939 -0.9381 -1.6426
quadrupole: 8.9748 -8.8299 -0.1449 0.5939 -0.9381 -1.6426
hfenergy: -503.5320357 hartree
pointgroup: C01 [X(C9H18O2)]
dipole: -0.3191229 -0.0938949 0.1907802 debye
polarizability: 123.034238|-1.0553733|92.6970997|4.1829168|1.557663|92.2216708 unknown
InChI: InChI=1S/C9H18O2/c1-4-5-9(3)6-8(10)7(2)11-9/h7-8,10H,4-6H2,1-3H3
charge 0 multiplicity 1
29 atoms
O  -0.655781 1.282939 -0.049538
O  -2.283908 -2.023631 -0.222612
C  0.412592 0.401258 0.571813
C  -0.238921 -1.015393 0.662111
C  -1.7313 -0.792335 0.354211
C  -1.698772 0.408885 -0.624364
C  1.637046 0.44273 -0.374835
C  0.703462 1.022024 1.948102
C  2.853417 -0.398417 0.078411
C  -2.990284 1.215074 -0.744513
C  3.988639 -0.388959 -0.968868
H  -0.081223 -1.488938 1.64493
H  0.162571 -1.69231 -0.114287
H  -2.289292 -0.496744 1.26948
H  -1.380046 0.027736 -1.621293
H  1.944653 1.500443 -0.493735
H  1.307103 0.095208 -1.375274
H  1.507895 0.476569 2.473588
H  1.012397 2.075804 1.830022
H  -0.201841 1.000419 2.58035
H  2.538911 -1.44511 0.265547
H  3.242578 -0.010158 1.040012
H  -2.844324 2.085578 -1.406736
H  -3.80131 0.595441 -1.173424
H  -3.307239 1.585895 0.246866
H  -3.264219 -1.923055 -0.321977
H  3.645595 -0.817556 -1.92933
H  4.3356 0.642544 -1.168029
H  4.8590 -0.97854 -0.626628
