program: Gaussian 09
title: 000256752
version: EM64L-G09RevD.01
frameworkgroup: C1[X(C22H17ClN2O)]
method: RPBEPBE
basis: SDD
operation: Freq
keyword: #p
keyword: freq=noraman
keyword: PBEPBE/SDD
title: #p freq=noraman PBEPBE/SDD
converged: YES YES NO NO
title: Mulliken charges:
elementType: Cl O N N C C C C C C C C C C C C C C C C C C C C C C H H H H H H H H H H H H H H H H H
charge: -0.089243 -0.483352 -0.478352 -0.131800 -0.419468 0.419624 0.525719 0.043488 -0.410638 -0.103398 0.489616 -0.461514 0.480117 -0.432710 -0.364246 -0.327552 -0.228333 -0.233430 -0.434986 -0.348723 -0.241763 -0.179929 -0.373442 -0.189586 -0.212778 -0.124513 0.234168 0.363395 0.229827 0.238076 0.219781 0.253539 0.253406 0.224639 0.224726 0.226297 0.248334 0.228384 0.390438 0.234274 0.250886 0.246184 0.244837
chargesum: 0.00000
title: Mulliken charges with hydrogens summed into heavy atoms:
elementType: Cl O N N C C C C C C C C C C C C C C C C C C C C C C
charge: -0.089243 -0.092914 -0.114957 -0.131800 -0.185300 0.419624 0.525719 0.043488 -0.180811 -0.103398 0.489616 -0.223439 0.480117 -0.212929 -0.110707 -0.074146 -0.003694 -0.008704 -0.208689 -0.100389 -0.013379 0.054345 -0.122556 0.056597 0.032059 -0.124513
polarizability: 3.78309646e+02 2.48235338e+01 2.32910934e+02 -7.54176640e+00 -3.86386657e+01 2.11832665e+02
1716.lowfreq: -6.8992 -3.3847 -0.0009 -0.0007 -0.0004 3.3321 18.5163 24.6777 33.9677
frequency: 18.3750 24.6259 33.9538 36.7187 49.1210 52.7225 89.2881 114.1034 140.6931 158.9465 197.0527 202.1628 216.3703 234.2020 244.0471 288.8264 309.2101 324.2666 332.0964 385.4610 400.7221 413.0041 427.4133 471.6207 492.1392 493.8515 496.3618 509.7650 518.2350 557.9807 572.4839 577.3394 589.9348 614.5458 616.7814 637.9408 654.5727 678.4205 689.5111 690.8942 705.2288 745.4930 761.8843 776.8681 788.5576 793.8024 800.2050 809.5843 821.8447 839.5333 846.5865 852.6282 874.0148 919.0910 922.8457 938.7169 943.4337 957.8301 966.3294 975.6312 984.2184 989.9288 989.9910 995.6043 1024.3669 1040.1743 1071.5228 1075.7430 1080.2849 1100.6195 1123.3570 1148.6370 1172.1365 1178.5591 1184.3258 1187.9956 1189.6790 1214.6801 1232.8932 1248.1194 1267.5378 1286.1461 1292.3275 1302.4240 1328.4921 1339.7091 1368.7051 1371.7976 1376.0491 1387.2997 1412.3960 1415.0589 1442.2043 1445.7595 1455.1854 1477.7455 1485.4440 1500.5943 1517.1286 1568.0917 1585.8594 1592.6015 1595.4679 1608.3054 1617.4733 1642.4260 2957.2177 3101.2460 3124.9351 3126.0098 3128.2636 3135.9808 3136.4964 3142.8061 3147.6699 3152.9509 3153.0204 3162.9369 3165.7529 3173.8594 3173.9411 3190.6569 3493.9741
redmass: 7.6636 4.9569 4.2033 5.6838 6.1753 3.9647 7.1566 6.7065 8.6115 5.3529 5.4161 7.3432 5.1191 4.4630 6.0913 5.3308 5.1731 5.3014 5.7493 8.7154 2.8087 2.9961 3.8212 4.2862 3.4374 4.9671 4.2044 3.4663 4.2404 1.4608 6.6760 3.3099 3.6267 6.3035 6.1837 5.7508 6.4345 4.7904 3.0967 5.2733 1.7081 2.8017 1.2733 1.4486 1.9661 1.3654 3.4078 1.7472 3.6416 4.4436 1.7245 1.2790 5.9910 1.4650 1.3564 1.3482 1.4002 1.3802 3.7740 1.3951 4.1460 5.0251 1.4563 1.3213 2.3380 2.3465 2.6473 1.9621 2.8955 2.0847 1.6650 1.3390 1.0898 2.0565 1.3595 1.2364 1.6311 1.5579 2.1368 2.1816 1.5417 1.4274 1.7957 1.5122 2.0232 1.4218 3.1412 2.7469 2.3042 5.0572 2.3597 2.9929 2.2142 4.7845 3.6793 2.1990 2.3156 3.5687 1.9102 7.0679 4.5420 5.7646 6.0095 6.0154 6.4699 6.3229 1.0838 1.0882 1.0856 1.0892 1.0870 1.0910 1.0879 1.0922 1.0954 1.0875 1.0970 1.1013 1.0953 1.0983 1.0964 1.0636 1.0787
irintensity: 0.2044 0.4317 0.0666 0.6448 0.3806 0.1949 0.6005 0.5699 1.6171 0.3033 1.2073 2.0005 0.9852 4.0744 2.1744 2.5622 0.2432 0.6556 3.8734 15.9521 0.5599 0.0534 2.7015 8.7086 27.7744 3.1556 3.8142 9.7087 5.9411 76.0358 4.1640 23.0125 16.4884 0.8974 5.5588 17.8080 5.8044 10.0763 0.1995 15.7435 58.7889 77.1881 70.2510 24.4331 35.6679 13.2586 17.2508 91.9701 18.2493 3.4327 39.5081 2.9774 3.7070 3.7853 0.2560 0.1458 0.2717 0.3916 3.2933 0.7438 15.0923 0.6554 1.3507 0.6092 7.0011 1.8058 29.6604 15.1136 50.0784 13.3018 8.6263 3.2891 1.3164 13.2193 8.0956 3.1139 36.6204 12.4290 4.1673 8.0816 85.3128 30.1084 73.7852 5.1980 81.1673 28.5276 12.6586 8.3609 114.4547 8.2891 17.1411 0.9108 5.2445 61.8383 36.1278 15.7039 136.6269 49.9898 397.3303 20.8067 16.3841 4.1840 1.4379 6.2057 190.8425 1.2652 22.3673 12.6361 0.0337 12.5305 6.8169 15.7247 5.6471 19.9977 23.2342 12.3193 16.2808 30.6095 10.1983 44.3785 5.5957 158.4268 237.2051
temp: 298.150 k
press: 1.00000 atm
elementType: 17 8 7 7 6 6 6 6 6 6 6 6 6 6 6 6 6 6 6 6 6 6 6 6 6 6 1 1 1 1 1 1 1 1 1 1 1 1 1 1 1 1 1
symmnumber: 1
zpe: 868361.2 jmol-1
zpe.correction: 0.330741 hartree
zpe.thermalcorrener: 0.352017 hartree
zpe.thermalcorrenthalpy: 0.352961 hartree
zpe.thermalcorrgfe: 0.277735 hartree
zpe.sumelectzpe: -1491.555780 hartree
zpe.sumelectthermal: -1491.534504 hartree
zpe.sumelectthermalent: -1491.533560 hartree
zpe.sumelectthermalfe: -1491.608786 hartree
dipole: -8.2335 1.0095 -0.9402
dipole: 8.3483
quadrupole: -158.3943 -150.4327 -146.2614
quadrupole: 13.9085 4.0671 -8.9892
quadrupole: -6.6982 1.2634 5.4348 13.9085 4.0671 -8.9892
hfenergy: -1491.8865213 hartree
pointgroup: C01 [X(C22H17Cl1N2O1)]
dipole: 3.2039691 -0.6575715 -0.299933 debye
polarizability: 380.6468548|10.4762467|226.7328304|16.2747567|38.7731019|215.6735597 unknown
InChI: InChI=1S/C22H17ClN2O/c23-17-9-11-18(12-10-17)25-20(15-5-2-1-3-6-15)19-13-8-16-7-4-14-24-21(16)22(19)26/h1-14,20,25-26H
charge 0 multiplicity 1
43 atoms
Cl -6.993232 2.181814 -0.386854
O  1.237573 1.05244 1.563029
N  -1.098105 0.851369 0.082426
N  3.840378 1.350696 1.406815
C  -0.410893 -0.223653 -0.636379
C  1.105026 0.019872 -0.670745
C  -0.699174 -1.643796 -0.087565
C  1.827889 0.5971 0.382056
C  1.85189 -0.40565 -1.821156
C  3.253057 0.760423 0.300644
C  3.979078 0.326952 -0.860668
C  3.238383 -0.266964 -1.931734
C  -2.463775 1.113499 -0.029328
C  -0.97635 -2.709502 -0.97684
C  -0.666563 -1.898166 1.305861
C  5.39648 0.535109 -0.839142
C  -1.212293 -4.014499 -0.486934
C  -0.903986 -3.199567 1.797976
C  -3.023843 2.203926 0.705465
C  -3.331304 0.350707 -0.867758
C  -1.175482 -4.262959 0.903954
C  5.991002 1.131654 0.278727
C  5.175236 1.527581 1.387287
C  -4.389543 2.527347 0.602346
C  -4.699793 0.678973 -0.97838
C  -5.21567 1.762245 -0.245966
H  -0.755628 -0.207713 -1.691699
H  -0.563162 1.324022 0.816046
H  1.294229 -0.861087 -2.647978
H  3.760373 -0.606408 -2.832741
H  -1.015567 -2.51977 -2.058216
H  -0.463088 -1.072873 1.997387
H  6.002901 0.225174 -1.69773
H  -1.432144 -4.830416 -1.184856
H  -0.880915 -3.38648 2.877656
H  -2.376932 2.805042 1.355746
H  -2.956053 -0.517866 -1.415154
H  -1.363041 -5.27185 1.288304
H  2.011256 1.414572 2.108814
H  7.070791 1.30188 0.321825
H  5.624194 1.996043 2.269655
H  -4.803395 3.365935 1.170368
H  -5.355806 0.084646 -1.621567
