program: Gaussian 09
title: 000256750
version: EM64L-G09RevD.01
frameworkgroup: C1[X(C22H17BrN2O)]
method: RPBEPBE
basis: SDD
operation: Freq
keyword: #p
keyword: freq=noraman
keyword: PBEPBE/SDD
title: #p freq=noraman PBEPBE/SDD
converged: YES YES NO NO
title: Mulliken charges:
elementType: Br O N N C C C C C C C C C C C C C C C C C C C C C C H H H H H H H H H H H H H H H H H
charge: -0.032043 -0.471449 -0.472072 -0.125006 -0.413060 0.422237 0.511411 0.051489 -0.420915 -0.105260 0.490763 0.596735 -0.462678 -0.428973 -0.351391 -0.328844 -0.229324 -0.237449 -0.454840 -0.349408 -0.242035 -0.179918 -0.373536 -0.183356 -0.231804 -0.272600 0.232767 0.368837 0.228067 0.237118 0.218671 0.258844 0.252453 0.223673 0.225387 0.253339 0.227710 0.391069 0.233423 0.250402 0.240492 0.221022 0.230052
chargesum: 0.00000
title: Mulliken charges with hydrogens summed into heavy atoms:
elementType: Br O N N C C C C C C C C C C C C C C C C C C C C C C
charge: -0.032043 -0.080380 -0.103235 -0.125006 -0.180293 0.422237 0.511411 0.051489 -0.192848 -0.105260 0.490763 0.596735 -0.225560 -0.210302 -0.092547 -0.076391 -0.005651 -0.012063 -0.454840 -0.096070 -0.014325 0.053505 -0.123134 0.057137 -0.010782 -0.042547
polarizability: 3.43790311e+02 4.16982353e+01 2.78421706e+02 -1.10672535e+01 -4.39331365e+01 2.07546243e+02
1716.lowfreq: -5.2720 -0.2188 0.0004 0.0005 0.0005 6.6689 19.8400 24.9484 26.4072
frequency: 19.7679 24.9106 26.3714 34.2572 41.1976 52.3172 97.0646 123.8421 134.0924 159.5205 167.6821 188.6661 210.0895 228.4500 235.4110 270.6263 290.6999 298.3510 332.1580 345.8909 400.8892 427.9226 434.1840 460.9026 492.5165 495.8826 505.9692 523.7772 539.8374 567.3540 573.4459 581.5259 585.7779 604.7298 615.3786 635.0678 652.2824 680.2259 690.7595 703.7760 706.1426 741.7966 745.9271 753.5407 776.3631 789.0424 800.7357 819.3775 828.5752 843.4360 847.1527 852.8969 874.0674 919.0907 922.0577 942.7647 957.4424 963.2454 967.5414 975.8544 988.9995 989.6061 990.1848 996.1969 1024.9044 1039.8751 1042.9981 1073.2975 1081.2822 1098.1725 1132.7751 1148.8493 1170.6803 1171.8883 1180.1000 1187.2833 1189.3204 1213.1626 1232.9291 1249.0420 1256.5866 1263.9181 1289.3242 1309.7083 1337.6993 1340.2063 1365.9740 1371.2244 1377.1534 1387.0240 1413.5988 1432.7624 1441.4354 1444.4656 1453.5882 1465.7165 1478.3961 1500.8436 1517.0290 1563.3431 1569.8568 1592.0517 1594.9250 1608.9933 1615.7802 1642.0859 2963.3236 3101.1384 3125.3459 3126.4704 3131.8574 3135.6805 3136.8703 3142.1720 3150.0228 3150.4775 3151.9959 3163.3636 3164.3024 3173.2024 3175.1128 3227.7858 3470.9050
redmass: 4.8046 5.9462 6.9565 5.7054 5.0487 7.1281 6.4768 5.0250 6.7123 5.3704 6.1400 5.4983 4.8691 5.4053 4.4971 5.1463 8.9071 5.2876 5.7737 5.5139 2.8153 3.8195 3.2568 4.6998 4.7337 5.8329 4.3789 4.1069 3.4040 4.0631 3.3540 2.8206 2.9095 2.7098 6.3750 5.6422 6.5881 4.7177 5.5507 2.0593 2.3409 1.3603 2.5448 1.1687 1.4897 2.2904 3.5761 2.8262 1.7427 3.1377 2.0338 1.3054 5.9517 1.4688 1.3770 1.4014 1.3772 1.4568 2.9782 1.3938 6.4680 1.3893 6.0713 1.3366 2.3383 2.3483 2.1289 1.9836 2.8591 2.4030 1.7035 1.3380 1.0985 1.0961 2.1958 1.3283 1.6724 1.5631 2.1196 2.2295 1.5962 1.5419 1.6444 1.5519 1.3108 2.0421 3.1682 3.0050 2.3036 5.2433 1.9658 2.8290 2.3172 4.4705 3.1015 2.3498 2.2077 3.6391 2.2213 5.0940 5.3553 6.1096 6.1634 6.0387 6.7290 6.4178 1.0836 1.0882 1.0859 1.0870 1.0859 1.0878 1.0914 1.0923 1.0951 1.0895 1.0968 1.1009 1.0936 1.0989 1.1000 1.0630 1.0783
irintensity: 0.0957 1.0793 0.0213 0.0807 0.3797 0.3355 0.2080 1.0547 1.7435 0.1230 0.5255 3.4736 1.2538 2.6443 3.1765 1.9649 1.7042 2.7796 1.0988 0.2434 0.4125 2.3457 8.0781 3.6892 14.6616 3.0822 8.6706 1.2306 4.9957 9.1043 12.0963 25.0330 37.8334 24.9068 0.9315 13.7649 12.1616 18.9512 13.5142 36.4194 25.0123 101.9907 53.4685 106.0234 14.1105 35.5549 15.3249 4.4254 14.3136 9.0843 33.2681 2.9906 5.3112 3.7633 3.1487 0.2854 0.4867 1.0341 3.8543 0.4276 47.1156 0.8580 13.3584 0.5157 8.3988 1.3766 9.7469 8.2393 53.1465 13.1946 3.4791 5.0102 0.9523 1.6899 15.6891 14.6467 22.1306 18.9434 5.0165 10.4524 5.8546 96.9421 69.1319 20.3712 3.1668 72.4102 18.9770 13.4337 100.4773 9.8627 17.6309 25.3360 5.9212 50.7337 24.3912 41.0097 14.7178 48.0609 348.2512 1.1896 23.0472 0.2394 5.9287 8.1399 289.1955 1.6349 20.7575 12.4761 0.6452 5.8804 7.2579 4.3613 20.2474 17.6395 19.4822 9.5975 19.5020 31.8014 21.5075 32.4362 14.2259 150.9204 154.7237
temp: 298.150 k
press: 1.00000 atm
elementType: 35 8 7 7 6 6 6 6 6 6 6 6 6 6 6 6 6 6 6 6 6 6 6 6 6 6 1 1 1 1 1 1 1 1 1 1 1 1 1 1 1 1 1
symmnumber: 1
zpe: 867327.8 jmol-1
zpe.correction: 0.330348 hartree
zpe.thermalcorrener: 0.351822 hartree
zpe.thermalcorrenthalpy: 0.352766 hartree
zpe.thermalcorrgfe: 0.276617 hartree
zpe.sumelectzpe: -1044.956014 hartree
zpe.sumelectthermal: -1044.934540 hartree
zpe.sumelectthermalent: -1044.933596 hartree
zpe.sumelectthermalfe: -1045.009745 hartree
dipole: -5.0555 1.8573 -1.3904
dipole: 5.5625
quadrupole: -133.6460 -152.8979 -153.1429
quadrupole: 9.5421 2.6153 -7.4821
quadrupole: 12.9163 -6.3357 -6.5806 9.5421 2.6153 -7.4821
hfenergy: -1045.286362 hartree
pointgroup: C01 [X(C22H17Br1N2O1)]
dipole: 1.8157908 -1.009653 -0.6875994 debye
polarizability: 356.7614053|22.4510974|251.6724516|24.3717967|47.8031119|221.3244026 unknown
InChI: InChI=1S/C22H17BrN2O/c23-18-10-4-5-11-19(18)25-20(15-7-2-1-3-8-15)17-13-12-16-9-6-14-24-21(16)22(17)26/h1-14,20,25-26H
charge 0 multiplicity 1
43 atoms
Br -2.081747 3.546202 1.2760
O  1.050224 1.020096 1.436172
N  -1.253651 0.839531 -0.130731
N  3.675983 1.243647 1.311277
C  -0.588036 -0.343546 -0.685731
C  0.935065 -0.153502 -0.717044
C  -0.940678 -1.667163 0.03656
C  1.657505 0.472045 0.308171
C  1.684328 -0.675597 -1.823946
C  3.087488 0.592526 0.240378
C  3.817033 0.060463 -0.877716
C  -2.59224 1.13782 -0.348554
C  3.076349 -0.584197 -1.918781
C  -1.182944 -2.842283 -0.714989
C  -1.001193 -1.726773 1.450717
C  5.239411 0.231586 -0.848938
C  -1.474409 -4.064623 -0.067785
C  -1.293799 -2.946049 2.099174
C  -3.18576 2.32912 0.175995
C  -3.454445 0.294411 -1.119671
C  -1.529552 -4.119428 1.343637
C  5.835019 0.888854 0.233417
C  5.015253 1.383381 1.298829
C  -4.525592 2.677837 -0.055038
C  -4.797481 0.641288 -1.362182
C  -5.347502 1.832628 -0.838325
H  -0.909055 -0.453344 -1.742463
H  -0.726583 1.397799 0.548768
H  1.126243 -1.166152 -2.630264
H  3.602181 -0.996964 -2.786335
H  -1.148831 -2.803264 -1.812353
H  -0.823077 -0.81637 2.033279
H  5.848291 -0.15349 -1.674786
H  -1.665388 -4.966597 -0.660386
H  -1.341225 -2.98229 3.193502
H  -3.070744 -0.655247 -1.501952
H  -1.759825 -5.063833 1.849521
H  1.809542 1.411767 1.977457
H  6.918423 1.033281 0.280989
H  5.465008 1.901586 2.152595
H  -4.924642 3.603716 0.37028
H  -5.422247 -0.035043 -1.95649
H  -6.391797 2.102675 -1.022062
