program: Gaussian 09
title: 000256739
version: EM64L-G09RevD.01
frameworkgroup: C1[X(C22H27ClO2)]
method: RPBEPBE
basis: SDD
operation: Freq
keyword: #p
keyword: freq=noraman
keyword: PBEPBE/SDD
title: #p freq=noraman PBEPBE/SDD
converged: NO YES NO NO
title: Mulliken charges:
elementType: Cl O O C C C C C C C C C C C C C C C C C C C C C C H H H H H H H H H H H H H H H H H H H H H H H H H H H
charge: 0.082664 -0.287073 -0.268706 0.324899 -0.165384 -0.115479 0.168209 -0.159229 -0.524253 -0.557013 -0.523697 -0.487551 -0.509980 -0.822930 0.249835 -0.581566 0.302444 0.447810 -0.372018 -0.547425 -0.540094 -0.415793 0.318485 -0.582217 -0.535906 0.243884 0.241104 0.207100 0.216718 0.224338 0.218715 0.229133 0.232966 0.227454 0.223673 0.192488 0.219924 0.216563 0.219313 0.224059 0.255333 0.221769 0.226387 0.219928 0.253708 0.213568 0.231034 0.225734 0.237674 0.218501 0.218742 0.242156
chargesum: 0.00000
title: Mulliken charges with hydrogens summed into heavy atoms:
elementType: Cl O O C C C C C C C C C C C C C C C C C C C C C C
charge: 0.082664 -0.287073 -0.268706 0.324899 0.078501 0.125625 0.168209 0.047870 -0.083197 -0.109165 -0.063277 -0.071391 -0.073493 -0.124225 0.249835 -0.133409 0.302444 0.447810 -0.152090 -0.293717 0.130242 -0.178119 0.318485 -0.582217 0.143493
polarizability: 3.25095317e+02 3.71688550e-02 2.19017158e+02 -5.87640318e+00 -1.09193291e+01 2.01691736e+02
1716.lowfreq: -4.5993 0.0021 0.0023 0.0025 3.6112 8.0515 21.1485 34.1792 47.5939
frequency: 21.1359 34.1636 47.5864 64.9939 77.6076 85.3118 103.5481 121.9822 125.8687 153.0068 173.7929 189.1107 199.7000 211.7168 217.5039 221.5870 233.7480 252.4360 255.1699 271.7536 277.9834 290.1576 300.7892 326.1431 343.7635 348.9577 362.4984 382.5688 404.3077 419.1944 437.6414 442.7297 463.1792 485.7837 497.8199 509.0857 545.0865 548.1516 563.6494 581.1888 622.8134 637.1836 669.5316 710.2143 715.5837 727.0993 775.7369 806.1023 813.9713 833.0041 836.3993 850.8732 869.6109 890.0635 895.1702 913.3563 931.2632 935.5373 945.9981 974.2140 983.5967 994.0881 1004.4601 1010.0146 1022.1630 1025.4202 1043.4997 1051.9539 1072.3756 1088.3147 1106.9500 1113.0361 1114.3662 1117.8347 1128.3771 1134.3856 1146.2189 1150.2658 1157.6327 1169.9214 1181.3885 1183.5145 1189.7522 1204.7404 1222.5361 1232.4720 1236.0604 1247.0344 1253.9003 1257.2573 1272.9344 1276.4391 1287.8075 1292.0089 1303.2933 1318.9006 1327.5593 1333.7162 1334.7912 1346.4087 1355.8272 1373.2094 1378.9278 1392.5114 1422.7950 1429.6357 1438.1121 1456.4892 1458.4997 1461.1165 1465.0307 1467.7753 1471.4149 1473.2593 1474.6511 1477.0597 1480.0247 1489.8410 1494.4367 1495.5061 1576.4496 1624.6559 2244.9391 2898.6915 2928.2329 2949.6075 2954.7859 2957.7334 2958.9791 2971.3942 2977.3514 2984.6940 2994.9318 3003.5714 3014.2240 3019.5034 3033.2420 3033.3798 3034.3649 3040.1690 3045.4467 3053.6756 3083.2408 3091.6995 3104.2114 3104.3421 3120.2884 3136.3026 3138.5570 3162.3005
redmass: 6.5015 5.8223 5.9490 3.5467 3.4936 3.5666 3.6474 2.3421 2.6765 2.6325 2.9290 3.5364 1.6919 1.7056 2.5115 2.2235 1.5407 2.3565 4.2726 3.0279 2.5887 3.4204 2.8208 3.6813 3.7956 3.6884 2.6319 3.5211 3.9272 4.7348 3.7203 2.9001 4.6965 2.7652 4.1047 3.2622 4.2705 4.7318 2.9539 3.8947 3.7568 3.1733 3.3376 4.5540 3.6248 2.6939 2.4152 2.0380 1.7373 2.0449 1.9261 1.9127 2.9755 2.1580 2.2297 2.7308 1.5665 2.0571 1.7344 2.2721 2.4831 2.3202 3.8214 2.7661 2.6382 3.3096 2.1300 2.7890 2.4282 2.2022 2.2729 1.2782 2.1019 1.3445 1.7983 2.2835 1.5253 1.5718 1.5270 1.8524 1.6139 1.4594 1.6228 2.0148 1.7597 1.3290 1.4805 2.4921 1.8527 1.4984 1.4758 1.3718 1.3835 1.4011 1.4927 1.3498 1.5470 1.3442 1.4330 1.4616 1.4722 2.8836 2.1073 1.1983 3.1254 1.1292 1.2552 1.0588 1.1313 1.0663 1.0504 1.0772 1.0923 1.0795 1.0758 1.0822 1.0541 1.0710 2.3004 1.0914 7.1398 6.7991 12.0118 1.0800 1.0800 1.0325 1.0331 1.0647 1.0782 1.0677 1.0594 1.0622 1.0608 1.0368 1.0624 1.0935 1.1008 1.1003 1.1015 1.1036 1.1025 1.1022 1.1035 1.0980 1.0991 1.0991 1.0990 1.0904 1.0872 1.0950
irintensity: 0.1302 0.1612 0.0929 0.4286 2.3275 3.2379 4.0209 2.7584 0.9180 0.8059 0.0657 0.5974 2.1622 2.1830 3.4257 0.4750 0.5342 1.5730 8.9181 1.7132 1.4711 1.1288 1.3504 1.2873 2.9485 1.6987 1.0064 0.0454 0.2399 3.6863 0.6796 5.0435 0.7234 1.4466 2.6289 1.1656 7.7247 4.2537 1.8987 9.2041 0.7237 2.2272 18.8430 2.8056 2.9981 7.9878 13.6533 4.4866 36.9356 2.8522 3.2813 5.6948 10.3454 22.0944 8.6363 3.7503 0.3130 0.4750 5.2593 14.7060 5.1974 3.6799 53.4150 42.2109 2.6211 88.9791 17.5188 19.5752 13.5847 2.5331 11.3091 0.0659 7.7811 3.0983 18.8165 4.2807 12.4111 3.8111 3.0477 21.2638 33.4249 0.8940 4.1921 7.8157 9.3967 14.1829 7.1105 99.1637 30.2392 1.9023 3.8825 12.5617 9.8888 1.1129 2.1119 1.4300 0.5275 1.5263 0.7199 2.2348 6.7690 9.8809 4.3530 24.4562 26.4878 1.5952 2.0634 9.2890 10.6625 2.8784 12.3715 8.3575 6.9592 20.7091 45.5509 5.0716 12.9869 8.8179 112.7840 3.8692 25.0092 70.9395 41.9718 14.0651 9.7725 76.5098 78.1589 24.3410 11.7172 44.1147 28.8118 32.3745 32.4379 25.3091 31.8576 38.5681 10.9769 46.8395 68.8368 51.6336 53.4451 14.9233 46.6513 26.6298 37.1123 9.4627 31.4038 16.1611 4.3918 18.9953
temp: 298.150 k
press: 1.00000 atm
elementType: 17 8 8 6 6 6 6 6 6 6 6 6 6 6 6 6 6 6 6 6 6 6 6 6 6 1 1 1 1 1 1 1 1 1 1 1 1 1 1 1 1 1 1 1 1 1 1 1 1 1 1 1
symmnumber: 1
zpe: 1142915.8 jmol-1
zpe.correction: 0.435314 hartree
zpe.thermalcorrener: 0.459537 hartree
zpe.thermalcorrenthalpy: 0.460481 hartree
zpe.thermalcorrgfe: 0.381956 hartree
zpe.sumelectzpe: -1463.073685 hartree
zpe.sumelectthermal: -1463.049461 hartree
zpe.sumelectthermalent: -1463.048517 hartree
zpe.sumelectthermalfe: -1463.127042 hartree
dipole: -0.5076 -0.0666 -0.0845
dipole: 0.5188
quadrupole: -141.8128 -151.9501 -154.7565
quadrupole: 10.6419 -10.7379 -5.3662
quadrupole: 7.6937 -2.4437 -5.2500 10.6419 -10.7379 -5.3662
hfenergy: -1463.5089986 hartree
pointgroup: C01 [X(C22H27Cl1O2)]
dipole: -0.2013111 -0.0056189 -0.0333361 debye
polarizability: 324.5606345|-0.4401466|224.1791001|-10.2299689|-1.1387156|197.0644774 unknown
InChI: InChI=1S/C22H27ClO2/c1-21-10-8-18-17-7-5-16(24-2)14-15(17)4-6-19(18)20(21)9-11-22(21,25-3)12-13-23/h5,7,14,18-20H,4,6,8-11H2,1-3H3
charge 0 multiplicity 1
52 atoms
Cl -4.748486 2.810524 2.59432
O  -4.431015 -0.074681 -1.597422
O  6.519315 0.131011 0.035143
C  -2.080736 -0.201834 -0.813419
C  -1.426377 -0.861552 0.441295
C  0.096722 -1.02137 0.293374
C  -3.601089 -0.255636 -0.386619
C  0.726038 0.39267 0.085963
C  -1.473625 1.204996 -1.015339
C  -2.30237 -2.112786 0.712478
C  -3.739725 -1.697183 0.247266
C  0.075994 1.144688 -1.112297
C  0.761721 -1.699994 1.509986
C  -1.906923 -1.045032 -2.105305
C  2.261231 0.322166 0.022757
C  2.252189 -1.970168 1.222333
C  2.97413 -0.77665 0.598246
C  -3.94432 0.783551 0.615372
C  3.019325 1.367822 -0.557891
C  4.385043 -0.787866 0.574391
C  -5.879201 -0.132051 -1.372741
C  4.431452 1.361106 -0.587543
C  5.119155 0.26721 -0.011532
C  -4.29136 1.625176 1.444666
C  7.317154 1.203158 -0.56047
H  -1.590199 -0.157583 1.288633
H  0.313494 -1.646331 -0.599789
H  0.46062 0.973104 1.001643
H  -1.754389 1.849006 -0.158254
H  -1.888945 1.678203 -1.925747
H  -2.285905 -2.403154 1.777401
H  -1.935674 -2.979923 0.131139
H  -4.116829 -2.377768 -0.538251
H  -4.460435 -1.708996 1.081891
H  0.390859 0.663086 -2.058884
H  0.452705 2.184061 -1.153507
H  0.252368 -2.653041 1.74949
H  0.654727 -1.04215 2.397293
H  -0.845891 -1.107298 -2.399374
H  -2.283259 -2.076429 -1.992909
H  -2.470152 -0.57708 -2.928979
H  2.330838 -2.831444 0.525892
H  2.777104 -2.276813 2.147507
H  2.502702 2.223746 -1.004214
H  4.941426 -1.623058 1.015041
H  -6.191508 -1.111998 -0.958766
H  -6.333151 0.006681 -2.366636
H  -6.217819 0.675101 -0.693783
H  4.967949 2.195384 -1.049399
H  7.13847 2.171349 -0.052318
H  7.106366 1.310947 -1.64281
H  8.364187 0.89772 -0.416322
