program: Gaussian 09
title: 000256736
version: EM64L-G09RevD.01
frameworkgroup: C1[X(C18H10Br2)]
method: RPBEPBE
basis: SDD
operation: Freq
keyword: #p
keyword: freq=noraman
keyword: PBEPBE/SDD
title: #p freq=noraman PBEPBE/SDD
converged: YES YES NO YES
title: Mulliken charges:
elementType: Br Br C C C C C C C C C C C C C C C C C C H H H H H H H H H H
charge: 0.012305 0.010268 0.294972 0.625071 0.204034 0.480369 0.543074 0.531215 -0.733242 -0.779483 -0.510698 -0.483963 -0.367323 -0.427071 -0.457369 -0.392204 -0.259366 -0.221857 -0.247134 -0.244712 0.230748 0.253429 0.248639 0.227193 0.249791 0.254303 0.237091 0.253434 0.233999 0.234487
chargesum: 0.00000
title: Mulliken charges with hydrogens summed into heavy atoms:
elementType: Br Br C C C C C C C C C C C C C C C C C C
charge: 0.012305 0.010268 0.294972 0.625071 0.204034 0.480369 0.543074 0.531215 -0.502494 -0.779483 -0.257269 -0.235324 -0.140129 -0.427071 -0.207578 -0.137901 -0.022275 0.031577 -0.013136 -0.010224
polarizability: 4.38958193e+02 1.22209522e+01 2.68737684e+02 -6.16231774e-03 2.93809905e-02 7.87239165e+01
1716.lowfreq: -3.4991 -0.0007 -0.0006 -0.0004 3.1368 7.7733 30.8965 55.1100 84.7292
frequency: 30.8819 55.1065 84.7202 95.7845 123.6569 165.3069 174.8081 182.9542 205.1968 228.9024 278.8202 295.0976 296.2310 341.9928 390.8705 417.6627 467.9832 471.0423 514.3790 518.9148 530.1822 546.9361 573.2833 582.1887 591.8946 632.2641 680.1621 697.8651 759.2849 763.9102 764.8437 772.2804 791.3256 812.0885 833.9334 859.3919 866.8374 870.9735 906.0348 907.5980 935.2005 971.1880 977.1408 985.6169 995.8216 998.7638 1028.2328 1076.1812 1106.8986 1141.6262 1172.2970 1179.0145 1201.8095 1228.3015 1241.4864 1254.4264 1269.9940 1288.5788 1324.3963 1370.0947 1379.5114 1389.4409 1400.6772 1423.0109 1427.1158 1439.9573 1474.3760 1490.6367 1542.2017 1551.7762 1585.5365 1603.9858 1617.2119 1628.9919 3125.0295 3140.2844 3143.5825 3152.0742 3155.0873 3158.3737 3169.5743 3172.8251 3176.7611 3180.0364
redmass: 8.2604 5.7257 4.4790 24.2162 4.9593 8.3721 4.2523 11.8753 4.8119 13.5054 4.4465 7.4875 4.0886 6.4313 6.5622 3.6149 3.7000 5.5619 3.6555 7.0135 3.3871 7.3943 3.0218 6.8028 4.7247 6.8511 7.2473 2.9145 1.3237 1.6129 6.8356 6.9826 1.9909 5.8157 2.5266 1.7096 4.4509 1.5915 6.7998 1.4257 2.3950 1.4027 1.3560 5.3998 1.3448 1.3460 2.2353 2.1678 2.8321 1.8482 1.2238 1.1646 1.4626 1.5625 1.7492 1.7078 2.4950 2.7222 2.4256 3.1164 4.9848 2.9507 2.2950 5.9262 3.2221 2.7126 2.6804 3.7463 6.2796 7.6597 5.7964 7.0047 6.7091 6.6202 1.0871 1.0893 1.0873 1.0905 1.0866 1.0948 1.0909 1.0986 1.0968 1.0980
irintensity: 0.0009 0.1400 0.2448 0.0311 1.2446 0.4998 0.6769 0.3064 1.3165 3.0079 2.4727 2.0892 5.1156 0.3498 0.4394 2.5078 3.1838 3.9785 1.7254 0.7952 5.4446 1.0016 2.9264 21.5739 0.4405 7.6098 27.8265 0.0552 108.9578 3.3773 33.1460 37.2736 4.7758 3.1988 15.0319 41.3448 36.5665 41.1043 18.7777 0.8982 5.5866 4.3995 2.3977 29.4598 0.0015 0.0043 5.1880 3.3042 41.6363 10.8184 2.2036 2.0508 2.2790 9.8049 35.9675 12.7460 22.7026 14.1118 8.8021 7.0920 11.3509 6.8191 6.9967 17.0003 2.8238 22.0193 8.6448 31.7219 42.5853 12.4097 10.3413 2.9171 7.7872 1.9196 1.2587 8.7397 7.5855 1.3041 4.9505 19.3349 7.8718 30.9271 5.6498 14.9893
temp: 298.150 k
press: 1.00000 atm
elementType: 35 35 6 6 6 6 6 6 6 6 6 6 6 6 6 6 6 6 6 6 1 1 1 1 1 1 1 1 1 1
symmnumber: 1
zpe: 570371.8 jmol-1
zpe.correction: 0.217243 hartree
zpe.thermalcorrener: 0.232762 hartree
zpe.thermalcorrenthalpy: 0.233706 hartree
zpe.thermalcorrgfe: 0.172501 hartree
zpe.sumelectzpe: -717.539480 hartree
zpe.sumelectthermal: -717.523961 hartree
zpe.sumelectthermalent: -717.523017 hartree
zpe.sumelectthermalfe: -717.584222 hartree
dipole: 1.2660 3.1602 0.0004
dipole: 3.4043
quadrupole: -122.3190 -115.8809 -141.8615
quadrupole: 0.7589 -0.0004 0.0035
quadrupole: 4.3682 10.8062 -15.1744 0.7589 -0.0004 0.0035
hfenergy: -717.7567227 hartree
pointgroup: C01 [X(C18H10Br2)]
dipole: -0.5371843 1.2269263 -0.0001575 debye
polarizability: 439.5608062|-6.8125941|268.1350707|-0.0052295|-0.0295613|78.7239165 unknown
InChI: InChI=1S/C18H10Br2/c19-17-7-3-6-13-14(17)8-9-15-16(13)10-11-4-1-2-5-12(11)18(15)20/h1-10H
charge 0 multiplicity 1
30 atoms
Br -2.138922 -3.344266 0.000518
Br 5.388331 -1.405988 0.000151
C  0.170203 0.286397 0.000005
C  -0.22106 -1.120966 0.000199
C  1.601883 0.641623 -0.000072
C  -2.219545 0.937566 -0.000032
C  2.594087 -0.408638 0.000056
C  -2.636491 -0.458907 0.000153
C  -0.839831 1.266268 -0.000101
C  -1.603205 -1.441063 0.000263
C  0.821789 -2.125585 0.00032
C  2.157093 -1.788169 0.000256
C  2.040348 1.997914 -0.000274
C  3.973836 -0.031989 -0.000023
C  -3.224947 1.966352 -0.000144
C  -4.044917 -0.750356 0.000212
C  3.403096 2.324302 -0.000349
C  4.390051 1.303469 -0.000222
C  -4.579651 1.648274 -0.000081
C  -4.989394 0.273743 0.000099
H  -0.581483 2.329165 -0.000244
H  0.530972 -3.179021 0.000468
H  2.916853 -2.574715 0.000357
H  1.312261 2.812693 -0.000377
H  -2.899644 3.013311 -0.000281
H  -4.369648 -1.794468 0.000348
H  3.718159 3.372749 -0.000506
H  5.453393 1.556588 -0.000281
H  -5.335659 2.440472 -0.000168
H  -6.056957 0.029046 0.000148
