program: Gaussian 09
title: 000256719
version: EM64L-G09RevD.01
frameworkgroup: C1[X(C7H11F2NO3)]
method: RPBEPBE
basis: SDD
operation: Freq
keyword: #p
keyword: freq=noraman
keyword: PBEPBE/SDD
title: #p freq=noraman PBEPBE/SDD
converged: YES YES NO NO
title: Mulliken charges:
elementType: F F O O O N C C C C C C C H H H H H H H H H H H
charge: -0.162404 -0.162328 -0.220209 -0.241939 -0.201559 -0.334342 0.164785 0.185507 0.236933 -0.252603 -0.257059 -0.671257 -0.660309 0.222781 0.223293 0.229983 0.239337 0.211812 0.240830 0.241665 0.218911 0.252468 0.233867 0.261835
chargesum: 0.00000
title: Mulliken charges with hydrogens summed into heavy atoms:
elementType: F F O O O N C C C C C C C
charge: -0.162404 -0.162328 -0.220209 -0.241939 -0.201559 -0.072508 0.164785 0.185507 0.236933 0.193471 0.212261 0.023051 0.044936
polarizability: 1.20334447e+02 4.48464677e+00 8.41929337e+01 -2.72564955e+00 -9.51273356e-01 8.00584089e+01
1716.lowfreq: -7.8282 -1.6496 -0.0006 -0.0003 0.0003 5.8536 19.9751 50.6689 57.4575
frequency: 19.7310 50.6589 57.4291 78.1735 94.0771 101.4854 117.3606 157.6854 183.0538 226.3819 228.0146 260.1869 278.1015 308.0511 325.3696 351.1202 393.0291 416.1660 461.5416 535.9174 664.0425 673.1359 716.2212 749.6134 799.7695 803.6618 816.2216 829.0154 832.7851 985.6207 994.8594 1004.4928 1034.1668 1037.5062 1066.2552 1096.9316 1114.7107 1133.0273 1159.3128 1211.8757 1260.2694 1267.5434 1275.7705 1354.8366 1363.0176 1393.1474 1403.9050 1459.9722 1460.6868 1463.0514 1475.6108 1484.6841 1485.9160 1633.7991 1661.3136 2967.8729 2996.3652 3002.6951 3030.0105 3034.5500 3091.7995 3099.6026 3099.7189 3115.4629 3126.2959 3393.9044
redmass: 4.8515 3.8000 3.0388 4.5336 4.4245 2.2964 4.7928 3.1214 2.4668 1.5693 1.8130 2.7329 5.3364 3.3878 10.5465 4.1923 5.6046 5.4078 4.9941 9.4968 7.5366 6.7328 4.5881 3.1244 1.4788 2.2720 1.6270 1.2776 2.4437 2.8209 2.8549 4.9557 2.3400 4.7294 5.2423 2.1576 2.2944 1.4371 1.6731 7.1193 1.1599 3.7340 1.1282 1.2901 1.4568 1.2285 1.2538 1.0857 1.0387 1.0482 1.0598 1.0526 1.0717 7.4070 10.9715 1.0553 1.0362 1.0367 1.1082 1.0603 1.0974 1.0988 1.1026 1.1018 1.1065 1.0777
irintensity: 1.5385 3.0084 0.1397 0.5533 0.3256 1.6127 0.3090 0.2931 0.9382 0.0814 0.6118 0.5753 12.3214 18.8555 1.1196 4.7507 0.3031 1.8153 2.1639 31.7486 42.2964 3.2468 9.6284 42.7379 35.3724 24.2891 4.8231 1.8601 5.9383 53.9230 50.0550 103.1748 106.0739 419.1927 81.9192 10.9898 5.3326 7.1867 17.8697 97.8483 5.2147 261.8299 9.4528 0.7070 3.0376 23.6362 18.6976 12.8139 12.7065 12.4508 9.0621 12.9114 8.6784 95.3612 175.6850 25.0538 16.8891 16.2496 26.9017 22.1605 29.5185 22.0045 1.6418 26.2168 26.7798 16.8803
temp: 298.150 k
press: 1.00000 atm
elementType: 9 9 8 8 8 7 6 6 6 6 6 6 6 1 1 1 1 1 1 1 1 1 1 1
symmnumber: 1
zpe: 471140.6 jmol-1
zpe.correction: 0.179448 hartree
zpe.thermalcorrener: 0.194433 hartree
zpe.thermalcorrenthalpy: 0.195378 hartree
zpe.thermalcorrgfe: 0.135708 hartree
zpe.sumelectzpe: -752.387667 hartree
zpe.sumelectthermal: -752.372681 hartree
zpe.sumelectthermalent: -752.371737 hartree
zpe.sumelectthermalfe: -752.431407 hartree
dipole: 2.2766 -4.2573 -0.8707
dipole: 4.9057
quadrupole: -48.2359 -75.6904 -81.9439
quadrupole: -2.9460 6.1435 -1.6275
quadrupole: 20.3875 -7.0670 -13.3205 -2.9460 6.1435 -1.6275
hfenergy: -752.5671146 hartree
pointgroup: C01 [X(C7H11F2N1O3)]
dipole: 0.9500133 1.1698711 1.2058151 debye
dipolederiv: -0.3859314 -0.0192561 -0.015383 -0.0436616 -0.5705706 0.237378 0.0009697 0.1798475 -0.4597018 -0.3804553 0.0004972 0.0987686 0.0039726 -0.4128401 -0.2257618 0.0775885 -0.1668344 -0.6065871 -1.6839988 0.3281644 -0.1921992 0.188415 -0.515539 0.0031453 -0.2466673 0.0231195 -0.233676 -1.0847886 0.1227715 0.401453 0.2224012 -0.3229354 -0.1512664 0.5489018 -0.0859868 -0.9440338 -0.5842461 0.064516 -0.2341234 0.0813573 -0.2960564 0.1374041 0.1256674 -0.0252267 -0.8600748 -0.4918885 0.1293606 0.0127379 0.3672078 -0.8083083 0.031089 0.0315452 -0.0109647 -0.3847798 0.7923721 0.141967 -0.0793617 0.0730462 1.0110711 -0.0095257 -0.1090359 0.0000338 1.0840265 1.2521357 -0.424796 0.1484208 -0.6000933 0.7957207 -0.0306835 0.1863498 0.0178447 0.0298873 1.0103073 -0.1287171 -0.0450569 -0.194015 0.2346773 -0.0423038 -0.5212251 0.0776646 1.4604037 0.8857547 -0.007329 0.0749269 0.2795743 0.2142166 0.0222821 0.1112362 -0.0198049 0.398621 0.8284516 -0.0679219 -0.22414 -0.142603 0.3371042 0.1355365 -0.1217141 0.0222165 0.3046724 -0.096055 0.0715628 -0.0139677 0.0447797 0.0262015 0.0062523 -0.0187708 0.0092938 0.0427285 -0.1497943 -0.0603283 0.0245774 -0.055977 -0.051687 -0.0695894 -0.0057338 -0.0200073 0.027079 -0.0326117 0.0269882 -0.0401224 -0.0876402 -0.0516614 0.0907918 -0.0156719 0.1149793 -0.0548878 -0.0546005 0.0504401 0.0578081 -0.0575013 -0.0051695 -0.1037717 0.00883 -0.0938356 -0.0824029 0.0023246 -0.0175084 -0.0049045 0.0165941 0.0452065 -0.0843093 0.0061984 -0.110599 -0.0743614 -0.008008 -0.0142319 0.052617 0.0224754 -0.0306365 0.0379424 -0.0145157 0.1279077 0.0213517 -0.1046755 -0.0720372 -0.0442223 -0.1017061 0.0185399 -0.0283842 -0.0488411 -0.023305 0.1083419 0.1011734 -0.0309473 0.0447026 0.0292246 0.0019399 0.106827 0.0259245 0.1076015 -0.016059 0.1083577 0.0084426 0.0021652 0.0596162 0.0469421 -0.076276 0.0345398 -0.0945665 -0.0665679 -0.1337512 0.0874652 0.0582024 0.0852529 0.0450437 -0.0111719 0.0423013 -0.0201662 0.115267 0.1221312 -0.002078 0.0227865 -0.0273148 0.0574539 -0.0543845 -0.012005 -0.0847458 -0.0711708 0.1004191 0.0190472 -0.045884 -0.0301068 -0.0333947 0.1049098 -0.0171271 0.1165942 0.0009122 -0.0126226 -0.2060717 -0.0598014 -0.1332982 0.2646815 -0.02613 -0.0687451 -0.0410605 0.2610117 unknown
polarizability: 119.937547|-6.4179444|84.1760059|-0.677771|1.6394388|80.4722363 unknown
InChI: InChI=1S/C7H11F2NO3/c1-3-12-5(10)7(8,9)6(11)13-4-2/h10H,3-4H2,1-2H3
charge 0 multiplicity 1
24 atoms
F  -0.056022 -1.292854 0.336121
F  0.23984 -0.859156 -1.881914
O  2.280449 0.094255 -0.151545
O  -1.952933 0.589046 0.549907
O  -2.008227 0.727384 -1.785579
N  0.764602 2.019986 -0.229642
C  -0.043171 -0.237215 -0.628773
C  1.069844 0.761797 -0.301536
C  -1.449594 0.419428 -0.717627
C  3.480882 0.924563 0.140764
C  -3.296328 1.250968 0.647041
C  4.663049 -0.034162 0.228579
C  -4.415398 0.220152 0.484268
H  3.612097 1.662552 -0.676208
H  3.317034 1.46314 1.095767
H  -3.281947 1.699355 1.652364
H  -3.348796 2.038733 -0.12469
H  5.58881 0.528538 0.446261
H  4.505687 -0.774562 1.030369
H  4.796591 -0.57477 -0.72304
H  -5.393119 0.707898 0.654289
H  -4.415586 -0.20515 -0.5330
H  -4.305524 -0.598317 1.215862
H  1.539062 2.679196 -0.029635
