program: Gaussian 09
title: 000256715
version: EM64L-G09RevD.01
frameworkgroup: C1[X(C14H15N3O2)]
method: RPBEPBE
basis: SDD
operation: Freq
keyword: #p
keyword: freq=noraman
keyword: PBEPBE/SDD
title: #p freq=noraman PBEPBE/SDD
converged: YES YES NO NO
title: Mulliken charges:
elementType: O O N N N C C C C C C C C C C C C C C H H H H H H H H H H H H H H H
charge: -0.256922 -0.182914 -0.079295 0.016938 -0.423520 0.345033 0.170889 -0.466385 -0.359021 -0.350231 0.239599 -0.037070 0.322709 -0.378725 -0.360103 -0.751461 0.209764 -0.804315 -0.536920 0.208820 0.209875 0.290805 0.240021 0.253218 0.313490 0.237372 0.236120 0.254524 0.233150 0.270805 0.239067 0.223041 0.222755 0.248890
chargesum: 0.00000
title: Mulliken charges with hydrogens summed into heavy atoms:
elementType: O O N N N C C C C C C C C C C C C C C
charge: -0.256922 -0.182914 -0.079295 0.016938 -0.110030 0.345033 0.170889 -0.257565 -0.149146 -0.059426 0.239599 -0.037070 0.322709 -0.138704 -0.106885 -0.023446 0.209764 -0.061294 0.157766
polarizability: 3.37059283e+02 -8.12390429e+00 1.95940701e+02 1.49848642e-01 -1.39366109e+00 8.65964733e+01
1716.lowfreq: -29.6930 -18.7016 -2.1311 -0.0007 -0.0006 0.0005 3.4887 9.8853 15.1012
frequency: -29.2983 -18.6420 14.8646 23.2332 47.4017 69.0058 77.6827 109.9426 132.8856 159.2359 176.9078 208.3192 220.4469 230.3962 230.6613 289.3832 334.5531 339.8326 351.0233 412.8575 459.5804 498.9929 504.5543 529.0009 562.2270 567.4224 580.0430 605.8956 628.0161 633.0856 672.9369 708.2325 744.3506 758.7669 763.2622 810.4489 825.6414 855.0292 878.0169 920.4565 933.2646 939.4243 953.6263 984.0701 985.2784 1000.5176 1002.8613 1030.0758 1049.2425 1054.5290 1095.4716 1111.4611 1114.9381 1154.5238 1183.6806 1192.8854 1217.7933 1237.8836 1253.7040 1301.6930 1326.6906 1349.0699 1372.6662 1380.1977 1391.4682 1409.3986 1429.1543 1434.9912 1439.5967 1453.7802 1463.0158 1463.9400 1467.2749 1468.8634 1471.5324 1501.7181 1544.9011 1554.3501 1578.2586 1622.3128 1669.8988 2962.8474 2985.2241 2993.9626 3052.1608 3071.0489 3084.3493 3128.7483 3132.8653 3133.2245 3136.9144 3148.0599 3157.6701 3164.0670 3177.2140 3525.2781
redmass: 1.0210 1.0963 3.6782 6.8255 3.8342 4.6678 3.4781 4.3171 4.6681 3.5620 3.6295 4.0588 5.5872 3.0664 1.4604 3.1590 5.4611 6.2337 3.8099 2.9345 4.2193 4.5112 2.8398 4.5377 4.2789 3.5064 4.8049 3.0520 1.2988 6.6948 3.7363 5.9788 4.2066 2.7457 4.6539 1.4112 5.3636 1.5345 2.0291 5.3324 7.4461 1.4003 2.7964 2.1610 4.4397 2.6238 1.3415 1.6884 2.0791 2.2100 1.9907 1.2601 1.4157 1.3285 1.2911 3.1405 1.8768 2.7185 6.2498 1.3833 3.3249 3.9383 1.2312 1.6303 3.7279 2.7448 4.4721 1.2972 1.5951 1.1418 1.3578 1.1508 1.0501 1.0519 1.0790 2.7326 3.5431 4.0433 6.9923 6.3024 6.3511 1.0328 1.0383 1.0409 1.1041 1.0983 1.0912 1.0990 1.0892 1.1018 1.0980 1.0905 1.0883 1.0945 1.0969 1.0763
irintensity: 0.3679 0.8379 0.2977 5.5803 1.3846 1.1414 0.2330 5.4926 4.9078 2.0748 8.0004 1.1737 0.9563 1.4745 0.0656 0.4326 1.0380 6.3896 2.3901 0.1542 0.1962 2.2039 11.7907 37.3416 13.3162 6.6744 12.5425 3.7014 78.6682 2.1906 5.0106 0.9426 0.1745 2.0135 2.1819 22.0214 3.8920 97.5188 7.9327 7.5819 1.4476 0.0674 32.3635 10.8450 59.0602 19.8114 0.3496 9.0055 16.5821 9.5629 6.1765 0.2343 24.3695 13.2964 225.9740 148.4559 200.3884 67.2674 229.0101 4.6773 103.2851 86.9466 65.7588 9.9587 47.6648 51.1647 25.1018 34.0342 243.0504 23.1463 108.0160 151.3090 13.9602 21.2826 74.0559 209.6189 923.3243 169.7585 6.7796 129.4432 144.5352 78.5625 8.0574 8.2078 46.7231 15.8157 14.1529 31.5284 3.8849 8.2490 9.1811 12.5819 1.6315 18.1110 8.3760 9.8176
temp: 298.150 k
press: 1.00000 atm
elementType: 8 8 7 7 7 6 6 6 6 6 6 6 6 6 6 6 6 6 6 1 1 1 1 1 1 1 1 1 1 1 1 1 1 1
symmnumber: 1
zpe: 696096.4 jmol-1
zpe.correction: 0.265129 hartree
zpe.thermalcorrener: 0.282144 hartree
zpe.thermalcorrenthalpy: 0.283088 hartree
zpe.thermalcorrgfe: 0.217678 hartree
zpe.sumelectzpe: -855.829561 hartree
zpe.sumelectthermal: -855.812547 hartree
zpe.sumelectthermalent: -855.811603 hartree
zpe.sumelectthermalfe: -855.877013 hartree
dipole: 3.8422 -6.4751 0.7778
dipole: 7.5693
quadrupole: -114.7448 -91.1299 -114.6971
quadrupole: 3.4613 -4.0100 -0.4082
quadrupole: -7.8875 15.7274 -7.8398 3.4613 -4.0100 -0.4082
hfenergy: -856.0946906 hartree
pointgroup: C01 [X(C14H15N3O2)]
dipole: 1.5066742 2.5605545 -0.2047623 debye
polarizability: 336.9533455|8.5369843|195.9732207|3.6654814|2.1483327|86.6698907 unknown
InChI: InChI=1S/C14H15N3O2/c1-9-15-13(8-14(16-9)17-10(2)18)11-4-6-12(19-3)7-5-11/h4-8,17H,1-3H3
charge 0 multiplicity 1
34 atoms
O  5.662564 0.289122 0.178001
O  -5.385218 0.220119 0.335293
N  -0.434864 -1.716836 -0.036649
N  -2.767539 -1.014969 -0.084917
N  -3.317755 1.316669 -0.047839
C  1.443011 -0.158118 0.049691
C  -0.02277 -0.398671 0.007379
C  -0.982258 0.642179 0.019191
C  2.006143 1.143664 0.085808
C  2.333014 -1.271799 0.055651
C  -2.356489 0.282166 -0.032073
C  -1.775709 -1.96313 -0.076667
C  4.266038 0.218824 0.135512
C  3.401129 1.343368 0.12893
C  3.721935 -1.0917 0.097396
C  -2.219027 -3.402912 -0.14989
C  -4.728085 1.259859 0.100192
C  -5.373891 2.642842 -0.051978
C  6.279332 1.618392 0.224894
H  -0.686162 1.693956 0.074308
H  1.361836 2.0296 0.080103
H  1.895326 -2.273439 0.027254
H  3.797842 2.36247 0.156352
H  4.408317 -1.943704 0.102631
H  -2.929599 2.257263 -0.154707
H  -2.214505 -3.746195 -1.20209
H  -1.52626 -4.048286 0.413429
H  -3.245464 -3.502215 0.234273
H  -4.989202 3.353886 0.703451
H  -6.459561 2.538164 0.08425
H  -5.179479 3.0661 -1.055033
H  5.968962 2.17316 1.131438
H  6.029808 2.209072 -0.677796
H  7.362178 1.430296 0.257509
