program: Gaussian 09
title: 000256714
version: EM64L-G09RevD.01
frameworkgroup: C1[X(C11H11N3OS)]
method: RPBEPBE
basis: SDD
operation: Freq
keyword: #p
keyword: freq=noraman
keyword: PBEPBE/SDD
title: #p freq=noraman PBEPBE/SDD
converged: YES YES NO NO
title: Mulliken charges:
elementType: S O N N N C C C C C C C C C C C H H H H H H H H H H H
charge: 0.315566 -0.180695 -0.069199 -0.425941 0.008288 0.363338 -0.257930 -0.458265 0.248794 -0.019761 -0.280819 -0.751998 -0.142790 -0.525069 0.211621 -0.790015 0.219133 0.240044 0.308988 0.258489 0.239064 0.237368 0.247328 0.266894 0.254897 0.267174 0.215494
chargesum: 0.00000
title: Mulliken charges with hydrogens summed into heavy atoms:
elementType: S O N N N C C C C C C C C C C C
charge: 0.315566 -0.180695 -0.069199 -0.116953 0.008288 0.363338 -0.257930 -0.239132 0.248794 -0.019761 -0.040775 -0.017077 0.104538 -0.258175 0.211621 -0.052449
polarizability: 2.77945536e+02 1.02190300e+01 1.78947733e+02 5.10509772e-01 -1.98179100e+00 7.26758083e+01
1716.lowfreq: -5.4386 -0.0016 -0.0015 0.0017 2.5665 5.2297 18.0386 23.3300 38.9249
frequency: 17.9322 23.2927 38.9139 55.1964 66.2650 80.9139 105.9589 134.1099 167.7447 220.4585 234.9395 241.6962 283.5513 340.6628 358.8519 453.2740 476.9999 527.5818 560.4781 566.9887 570.1909 610.6720 618.7847 623.2916 677.9065 686.3620 708.1022 711.8771 759.3862 778.8971 826.0533 834.4503 870.3171 906.2312 913.6653 926.4137 957.6404 982.2928 1025.6031 1032.5977 1051.7563 1057.9129 1078.7546 1101.0279 1184.5292 1206.1878 1228.4129 1258.7038 1321.9722 1342.1437 1368.8482 1379.5278 1384.3709 1408.2745 1437.8706 1453.6592 1459.8523 1463.1601 1465.7852 1470.9259 1532.2966 1544.1242 1570.1784 1666.0003 2987.7062 2999.1753 3074.9816 3080.0663 3128.0388 3136.9082 3147.8795 3167.5952 3186.3737 3234.1264 3533.1787
redmass: 5.3009 1.0664 5.4883 1.0516 3.9779 5.1959 5.9771 4.8137 3.4097 10.3290 4.8233 6.4674 3.2140 4.5617 5.9271 5.5159 4.9856 4.2692 3.0846 3.2069 4.8652 2.9899 7.6429 1.2773 6.8473 5.7961 6.0890 1.1988 2.7277 5.4167 4.8151 1.3510 2.0025 5.1504 1.3798 8.2224 2.7001 1.6923 3.3497 1.6792 1.6196 1.9020 1.5728 1.3755 2.6132 1.9811 1.5562 4.7421 2.5782 4.5071 3.3402 1.2324 1.5511 2.6266 1.8475 1.3616 1.0471 1.6266 2.5664 1.1063 5.3122 3.2762 5.9484 6.4112 1.0380 1.0378 1.0986 1.0967 1.0981 1.1000 1.0926 1.0899 1.0970 1.1000 1.0763
irintensity: 7.0304 0.1391 0.4864 0.4452 0.5491 2.4293 0.1379 2.5555 7.7890 0.7240 1.1144 0.3077 0.2297 1.8888 1.0561 3.5914 5.3862 26.3112 0.0916 2.4148 6.8766 1.3129 1.3923 78.2358 1.7686 10.2547 10.0732 96.0002 0.9384 13.5353 9.5535 16.5639 47.3216 2.7097 0.5509 1.8661 29.3566 10.5028 28.6466 17.9208 7.3700 14.8088 12.8666 12.6050 100.6980 137.5861 11.2361 162.9257 1.3688 75.0693 33.5405 51.9321 64.8336 63.3092 370.1314 158.9353 16.4128 18.1066 45.9713 9.2814 199.8813 636.8827 217.1141 140.0321 9.2230 6.4904 16.6754 11.8108 9.0700 7.6421 8.9598 7.9293 7.0985 0.8235 11.7722
temp: 298.150 k
press: 1.00000 atm
elementType: 16 8 7 7 7 6 6 6 6 6 6 6 6 6 6 6 1 1 1 1 1 1 1 1 1 1 1
symmnumber: 1
zpe: 526888.3 jmol-1
zpe.correction: 0.200681 hartree
zpe.thermalcorrener: 0.216381 hartree
zpe.thermalcorrenthalpy: 0.217325 hartree
zpe.thermalcorrgfe: 0.153912 hartree
zpe.sumelectzpe: -1062.168824 hartree
zpe.sumelectthermal: -1062.153124 hartree
zpe.sumelectthermalent: -1062.152180 hartree
zpe.sumelectthermalfe: -1062.215593 hartree
dipole: -1.6588 -5.7858 0.8832
dipole: 6.0834
quadrupole: -98.5418 -86.9356 -104.0534
quadrupole: -11.4432 4.3881 -0.0967
quadrupole: -2.0315 9.5746 -7.5431 -11.4432 4.3881 -0.0967
hfenergy: -1062.369505 hartree
pointgroup: C01 [X(C11H11N3O1S1)]
dipole: -0.7754956 -2.24059 0.3265332 debye
polarizability: 278.6630692|4.3721286|178.1324233|-5.3151947|-0.1094577|72.7735845 unknown
InChI: InChI=1S/C11H11N3OS/c1-7-12-9(10-4-3-5-16-10)6-11(13-7)14-8(2)15/h3-6,14H,1-2H3
charge 0 multiplicity 1
27 atoms
S  -3.690359 0.950476 0.10512
O  4.356146 0.233705 -0.536428
N  -0.770126 1.488852 0.093663
N  2.496431 -1.132368 0.005451
N  1.633542 1.101566 0.07084
C  -0.992936 0.128243 0.0568
C  -2.387449 -0.306103 0.06165
C  0.089041 -0.785379 0.011591
C  1.401427 -0.241672 0.021353
C  0.528681 1.912306 0.094839
C  -2.93306 -1.590073 0.037353
C  0.770104 3.399782 0.134011
C  -4.369467 -1.610863 0.052719
C  -4.929267 -0.339718 0.088673
C  3.87511 -0.878328 -0.219382
C  4.739322 -2.126215 -0.009445
H  -0.079611 -1.865346 -0.036804
H  -2.326651 -2.499154 0.00944
H  2.251414 -2.114623 0.150217
H  1.850247 3.604356 0.128909
H  0.295046 3.886171 -0.736604
H  0.309746 3.839478 1.036784
H  -4.962424 -2.528271 0.037676
H  -5.982283 -0.062895 0.106783
H  5.012542 -2.210853 1.058945
H  5.667218 -2.013242 -0.589518
H  4.235914 -3.062932 -0.311238
