program: Gaussian 09
title: 000256709
version: EM64L-G09RevD.01
frameworkgroup: C1[X(C10H15N3O)]
method: RPBEPBE
basis: SDD
operation: Freq
keyword: #p
keyword: freq=noraman
keyword: PBEPBE/SDD
title: #p freq=noraman PBEPBE/SDD
converged: YES YES NO NO
title: Mulliken charges:
elementType: O N N N C C C C C C C C C C H H H H H H H H H H H H H H H
charge: -0.181698 -0.037260 0.009045 -0.424933 -0.482510 -0.359386 0.286453 -0.521497 -0.684963 0.253152 -0.028649 -0.754724 0.210913 -0.788600 0.221049 0.196865 0.202426 0.235457 0.230198 0.214083 0.207845 0.222960 0.309567 0.235153 0.235401 0.258176 0.214006 0.265927 0.255545
chargesum: 0.00000
title: Mulliken charges with hydrogens summed into heavy atoms:
elementType: O N N N C C C C C C C C C C
charge: -0.181698 -0.037260 0.009045 -0.115366 -0.064596 0.078498 0.286453 -0.291299 -0.040075 0.253152 -0.028649 -0.025995 0.210913 -0.053123
polarizability: 1.92666805e+02 -4.69592342e+00 1.43132955e+02 5.84019984e+00 6.20904762e+00 8.30716305e+01
1716.lowfreq: -11.9812 -5.8150 -0.0006 -0.0002 0.0004 7.5638 11.1781 17.9964 35.0467
frequency: -10.6552 17.1583 34.8186 39.7916 71.3034 81.9054 102.2201 118.6453 171.3815 230.1997 235.3361 247.3650 253.3493 280.6210 312.4963 347.2237 458.3959 522.4787 552.2999 570.4279 581.1574 622.3172 636.3219 687.4137 719.4191 746.5238 774.8443 857.2138 865.7208 879.6573 900.0596 927.9707 952.7258 973.3334 1008.5909 1032.8303 1051.3686 1052.8216 1062.8337 1089.5770 1096.3929 1175.3765 1198.9041 1224.3887 1250.0955 1275.5609 1283.5427 1328.8689 1341.8507 1367.1539 1381.2513 1387.4115 1390.1309 1409.7992 1441.0648 1454.5649 1459.3228 1460.2305 1465.1865 1471.0592 1475.7974 1478.0717 1485.6565 1549.8757 1556.9845 1664.6019 2973.6260 2983.6373 2988.8433 2991.6379 2997.7565 3034.8243 3055.1867 3075.4269 3076.9770 3077.3133 3078.4324 3124.8484 3134.8993 3136.4224 3533.3060
redmass: 1.0345 4.5468 3.0088 1.1037 3.5671 1.7180 4.4130 4.4320 3.5046 1.1658 5.1164 3.1093 4.3573 2.5780 3.4529 4.0449 3.2255 4.2565 4.6491 3.0914 3.9474 1.9312 1.7642 5.6745 4.6115 1.1547 2.8061 2.0410 1.6606 2.1875 1.8817 6.3086 3.0305 1.8923 3.2880 1.6774 1.6315 2.7277 2.2327 1.6413 1.9980 1.6668 2.2978 1.5871 4.6461 1.3601 1.1373 2.1008 2.1605 2.4449 1.2193 1.7224 1.2427 2.6051 1.5010 1.3633 1.0522 1.1658 1.1997 1.1430 1.0557 1.0434 1.0841 4.2147 4.1121 6.3962 1.0357 1.0607 1.0378 1.0606 1.0377 1.0979 1.1025 1.0995 1.0988 1.1020 1.0966 1.0981 1.0999 1.0928 1.0763
irintensity: 1.3275 5.4437 1.1672 0.8717 0.5046 0.1036 0.2796 2.9575 7.8206 0.1126 1.4516 0.9709 0.3316 0.7360 0.7122 0.9230 1.9839 23.8171 6.4338 2.2421 2.1749 25.3945 38.5661 15.8770 1.0598 5.2595 1.1778 20.5493 1.4222 16.4301 2.8738 1.5354 15.7909 19.9917 7.8698 16.3079 8.2044 2.6920 5.9877 9.3304 22.8521 2.1823 188.1889 62.1191 69.3404 13.0553 2.7190 10.8215 28.1898 22.8183 61.6485 83.0834 18.2776 45.7026 289.6557 182.6862 19.3824 32.1540 40.8682 12.1064 3.3393 14.0908 16.6992 554.2581 120.0643 141.3267 42.4902 4.2561 9.8014 51.0074 7.8434 1.6279 0.9030 50.7193 10.9410 75.6908 14.6183 8.8873 7.9404 12.2393 12.1519
temp: 298.150 k
press: 1.00000 atm
elementType: 8 7 7 7 6 6 6 6 6 6 6 6 6 6 1 1 1 1 1 1 1 1 1 1 1 1 1 1 1
symmnumber: 1
zpe: 624489.0 jmol-1
zpe.correction: 0.237855 hartree
zpe.thermalcorrener: 0.252605 hartree
zpe.thermalcorrenthalpy: 0.253549 hartree
zpe.thermalcorrgfe: 0.193314 hartree
zpe.sumelectzpe: -628.499409 hartree
zpe.sumelectthermal: -628.484660 hartree
zpe.sumelectthermalent: -628.483715 hartree
zpe.sumelectthermalfe: -628.543950 hartree
dipole: -1.2234 -5.1693 -1.2188
dipole: 5.4501
quadrupole: -86.3074 -75.7777 -84.9552
quadrupole: -11.4526 -4.7854 0.6798
quadrupole: -3.9606 6.5691 -2.6085 -11.4526 -4.7854 0.6798
hfenergy: -628.7372643 hartree
pointgroup: C01 [X(C10H15N3O1)]
dipole: -0.5205724 -1.9922975 -0.5979571 debye
polarizability: 192.4368389|-6.0376988|142.4238089|5.8384601|9.552331|84.0107425 unknown
InChI: InChI=1S/C10H15N3O/c1-4-5-9-6-10(13-8(3)14)12-7(2)11-9/h6,13H,4-5H2,1-3H3
charge 0 multiplicity 1
29 atoms
O  3.759078 0.344045 0.708438
N  -1.430489 1.17906 -0.185777
N  0.989388 1.018752 0.060505
N  2.086841 -1.102971 -0.145926
C  -2.87815 -0.75825 -0.622376
C  -3.735247 -0.738686 0.674342
C  -1.498432 -0.177987 -0.400634
C  -0.335047 -0.975789 -0.383649
C  -5.169345 -1.252142 0.430223
C  0.908903 -0.32473 -0.144634
C  -0.19138 1.715104 0.038306
C  -0.111991 3.202482 0.273593
C  3.411875 -0.759172 0.227044
C  4.410023 -1.889709 -0.047399
H  -3.395489 -0.15128 -1.389968
H  -2.801574 -1.79412 -1.00445
H  -3.240178 -1.355687 1.450341
H  -3.758588 0.29885 1.056362
H  -0.398687 -2.057214 -0.54613
H  -5.692393 -0.624501 -0.315526
H  -5.165298 -2.292026 0.051768
H  -5.762695 -1.234546 1.362392
H  1.954677 -2.072434 -0.44343
H  -0.516368 3.750592 -0.596242
H  -0.729989 3.484693 1.144731
H  0.931979 3.500206 0.447758
H  3.965033 -2.899195 0.017486
H  5.235753 -1.812597 0.675997
H  4.835591 -1.76415 -1.060446
