program: Gaussian 09
title: 000256707
version: EM64L-G09RevD.01
frameworkgroup: C1[X(C11H10ClN3)]
method: RPBEPBE
basis: SDD
operation: Freq
keyword: #p
keyword: freq=noraman
keyword: PBEPBE/SDD
title: #p freq=noraman PBEPBE/SDD
converged: YES YES NO NO
title: Mulliken charges:
elementType: Cl N N N C C C C C C C C C C C H H H H H H H H H H
charge: -0.057205 -0.091460 -0.068162 -0.629523 0.349564 0.176870 -0.425706 -0.350098 -0.359857 -0.020350 0.186762 -0.232150 -0.221653 -0.104439 -0.754963 0.211079 0.218746 0.294687 0.254471 0.256051 0.237136 0.236854 0.244015 0.316008 0.333323
chargesum: 0.00000
title: Mulliken charges with hydrogens summed into heavy atoms:
elementType: Cl N N N C C C C C C C C C C C
charge: -0.057205 -0.091460 -0.068162 0.019808 0.349564 0.176870 -0.214627 -0.131352 -0.065170 -0.020350 0.186762 0.022321 0.034398 -0.104439 -0.036958
polarizability: 2.60957237e+02 8.66010991e+00 1.60030960e+02 8.43517554e-02 -3.78034623e-01 6.25723005e+01
1716.lowfreq: -5.4665 -3.3546 -0.0023 -0.0021 -0.0020 4.5192 5.7629 38.8534 53.5166
frequency: 4.8527 38.7487 53.5120 101.3055 143.2826 170.8797 206.8525 229.7404 247.0587 301.4652 306.0927 359.1464 406.4156 418.9897 460.2519 477.7202 512.0422 524.1293 544.4292 581.7864 603.5599 626.9633 659.6203 696.1878 726.1884 757.2292 823.8930 846.1242 846.3511 870.1225 931.6332 953.3019 969.3766 992.3661 998.9574 999.8989 1051.0934 1073.4766 1076.9753 1094.9026 1111.8523 1185.7137 1234.1878 1275.3117 1294.9647 1340.2029 1377.5792 1386.2089 1396.0880 1400.0934 1433.5700 1458.3842 1467.7915 1484.4378 1514.8071 1575.8778 1582.9693 1599.7783 1620.1692 2998.3428 3080.7194 3130.3327 3144.8185 3159.4113 3161.0679 3172.6707 3177.7902 3546.6650 3702.2663
redmass: 3.7174 1.0237 8.2241 5.9619 5.4960 3.7593 5.1347 6.2148 6.4036 6.6263 3.2713 3.7248 2.8342 1.1848 8.9427 3.1648 3.2342 1.1445 7.0870 5.2389 2.6651 7.1217 5.9001 7.2352 3.6339 2.5752 1.4012 1.7938 3.1800 1.9781 8.5090 1.3792 2.1863 2.7909 1.4463 2.7149 1.6172 2.6756 2.1523 1.7321 1.5481 1.1567 2.2545 3.9189 1.2913 4.1272 1.9394 3.5163 3.4167 2.6976 3.1415 1.0472 1.2380 2.9879 6.7222 3.3374 7.0365 6.0755 1.5299 1.0374 1.0969 1.1000 1.0887 1.0886 1.0910 1.0958 1.0971 1.0450 1.1046
irintensity: 0.6384 0.8031 0.0274 1.0504 0.5793 4.4260 7.8409 2.5192 2.0282 0.7618 2.7640 0.8521 1.3381 173.4628 31.6012 14.9991 2.5353 125.2116 2.8708 3.6740 12.4545 1.2762 0.0092 10.9071 1.3385 3.7948 16.9407 72.9557 42.0610 1.7915 10.5061 0.0762 0.2447 14.9384 5.5357 29.5377 7.7882 43.2484 8.6708 8.0945 12.7926 12.3286 51.7305 16.7516 1.4792 8.0086 3.9796 11.6520 68.8725 72.1902 59.1865 16.0093 14.1168 70.2098 238.8810 296.3203 38.6832 62.6150 502.0264 10.0914 13.8006 13.9084 6.4760 0.3201 11.4439 8.9352 5.1063 106.7909 33.3585
temp: 298.150 k
press: 1.00000 atm
elementType: 17 7 7 7 6 6 6 6 6 6 6 6 6 6 6 1 1 1 1 1 1 1 1 1 1
symmnumber: 1
zpe: 494661.8 jmol-1
zpe.correction: 0.188407 hartree
zpe.thermalcorrener: 0.201993 hartree
zpe.thermalcorrenthalpy: 0.202937 hartree
zpe.thermalcorrgfe: 0.144834 hartree
zpe.sumelectzpe: -1048.452821 hartree
zpe.sumelectthermal: -1048.439235 hartree
zpe.sumelectthermalent: -1048.438291 hartree
zpe.sumelectthermalfe: -1048.496393 hartree
dipole: -2.4851 -3.3255 -0.0329
dipole: 4.1515
quadrupole: -97.0493 -75.6665 -98.9578
quadrupole: 9.3373 0.1170 -0.1097
quadrupole: -6.4914 14.8913 -8.3999 9.3373 0.1170 -0.1097
hfenergy: -1048.6412273 hartree
pointgroup: C01 [X(C11H10Cl1N3)]
dipole: -0.9628198 1.3183797 0.0515657 debye
dipolederiv: -1.063903 0.0393308 -0.0006009 0.0325301 -0.127295 -0.0004749 -0.0008387 -0.0005877 -0.0712316 -1.2714814 -0.3582707 -0.014416 -0.2869312 -0.7221576 -0.0205922 -0.0129956 -0.0198252 -0.2093964 -0.6586867 -0.028329 -0.0020911 0.2556835 -1.0517761 -0.0308704 0.0073514 -0.0298568 -0.2480472 -0.8548886 0.6728952 0.0254673 0.8482695 -0.9764493 -0.008481 0.0322716 -0.0089588 -0.7183798 -0.2653277 -0.0137441 -0.0019291 -0.0316326 -0.0565668 -0.00043 -0.0028748 0.0013253 -0.0207734 1.3564515 -0.026038 0.0008708 -0.0920891 0.5735458 0.0211206 -0.0018084 0.0178617 0.0866216 -1.0727488 0.499247 0.0188049 0.2496373 -0.2973229 -0.0019007 0.0098114 -0.0022425 -0.1828894 0.1019846 -0.0435861 0.0014549 0.1150046 0.0452691 -0.000039 0.0068582 0.0002002 -0.1334392 0.0284947 0.0672506 0.0005233 -0.1167132 0.0153215 0.0006183 -0.004776 0.0024717 -0.1122622 0.9727021 0.2808486 0.0106725 0.2460992 1.0268393 0.0357241 0.0102817 0.0330025 0.0534734 1.348356 -0.8048292 -0.0284058 -0.8256689 1.2551052 0.0385663 -0.0306794 0.0395499 0.2178123 -0.4480976 0.1074809 0.0003122 0.2267131 -0.0181767 0.0011267 0.0010005 0.0009265 -0.1127664 -0.4031306 -0.1066801 -0.0012099 -0.1720517 0.0316211 0.0015376 -0.0011822 0.0017294 -0.1118674 1.4263912 -0.0452876 0.0014731 -0.0898545 0.1620139 0.0021015 0.0013514 0.00202 -0.0645786 0.0150252 -0.0726179 -0.0021221 -0.217361 -0.3273826 -0.0123934 -0.0037445 -0.0069052 0.0169676 0.0728633 -0.0853081 -0.0039493 -0.0965973 -0.0780088 -0.0106409 -0.0049029 -0.0102196 0.1651369 0.0553739 0.1033293 0.0004845 0.0917009 -0.0471036 -0.0009355 -0.0000613 -0.0017954 0.1421971 0.1689341 -0.067459 0.0002429 -0.0494913 0.037531 -0.0007353 0.0016421 -0.0021924 0.1493624 0.0298209 -0.0669811 -0.0007589 -0.0741455 -0.0037702 -0.0015992 -0.0012461 -0.0014038 0.1664735 0.0388409 0.0658323 0.0005131 0.0727273 -0.0098958 -0.0017323 0.0005834 -0.0016988 0.1633544 0.0668149 0.0095613 0.0737901 -0.0063381 0.0422956 -0.0734703 0.0300964 -0.1058318 -0.0325758 0.0703371 0.0094111 -0.0695486 -0.0077269 0.0302958 0.0774608 -0.0282467 0.1088998 -0.026242 -0.1201419 -0.0377609 -0.00534 0.0626722 0.0938256 0.0001743 -0.0025272 -0.0023544 0.1194525 0.150791 -0.0477873 -0.0021533 -0.0945295 0.2166569 -0.0066806 -0.0040651 -0.0064574 0.3850868 0.2552249 -0.0505079 -0.0020845 -0.0399067 0.1855847 -0.0074545 -0.0012993 -0.0076571 0.3785108 unknown
polarizability: 260.7476791|-9.8036065|160.1739425|-0.0863207|2.575514|62.6388761 unknown
InChI: InChI=1S/C11H10ClN3/c1-7-14-10(6-11(13)15-7)8-2-4-9(12)5-3-8/h2-6H,13H2,1H3
charge 0 multiplicity 1
25 atoms
Cl 5.505111 -0.103756 0.029101
N  -1.255051 -1.13106 -0.022608
N  -3.430416 -0.044175 0.013927
N  -3.633855 2.278384 0.10289
C  0.861683 0.082963 0.025544
C  -0.630411 0.099633 0.024559
C  -1.383113 1.292716 0.069868
C  1.638668 1.272834 0.038347
C  1.53893 -1.166719 0.012074
C  -2.62081 -1.144787 -0.02532
C  -2.803599 1.17918 0.062204
C  3.047924 1.223604 0.039468
C  2.946525 -1.234982 0.013317
C  3.68258 -0.033985 0.027446
C  -3.293073 -2.495349 -0.07513
H  -0.909903 2.276926 0.11246
H  1.15838 2.25644 0.044842
H  0.930941 -2.07571 -0.000163
H  3.640615 2.142647 0.048561
H  3.460699 -2.200259 0.003432
H  -2.968595 -3.051004 -0.972815
H  -2.99965 -3.10073 0.801177
H  -4.386333 -2.37532 -0.089515
H  -3.269993 3.226099 0.140198
H  -4.638954 2.115912 0.095137
