program: Gaussian 09
title: 000263522
version: EM64L-G09RevD.01
frameworkgroup: C1[X(C13H11N3O4)]
method: RPBEPBE
basis: SDD
operation: Freq
keyword: #p
keyword: freq=noraman
keyword: PBEPBE/SDD
title: #p freq=noraman PBEPBE/SDD
converged: YES YES NO NO
title: Mulliken charges:
elementType: O O O O N N N C C C C C C C C C C C C C H H H H H H H H H H H
charge: -0.252423 -0.280012 -0.230904 -0.238781 -0.390620 -0.394772 -0.437894 0.454281 0.033935 -0.248442 0.496268 -0.399911 -0.333152 -0.370896 -0.473237 0.145837 0.166055 0.146744 0.224283 -0.796880 0.257940 0.240597 0.331262 0.315023 0.225782 0.367591 0.365400 0.319077 0.241851 0.274226 0.241769
chargesum: 0.00000
title: Mulliken charges with hydrogens summed into heavy atoms:
elementType: O O O O N N N C C C C C C C C C C C C C
charge: -0.252423 -0.280012 -0.230904 -0.238781 -0.023029 -0.029372 -0.118817 0.454281 0.033935 0.009498 0.496268 -0.159314 -0.001890 -0.055873 -0.247455 0.145837 0.166055 0.146744 0.224283 -0.039033
polarizability: 4.45514107e+02 -4.18395687e-01 1.73555034e+02 -7.96390778e-02 4.90598207e-02 7.32970900e+01
1716.lowfreq: -32.5286 0.0005 0.0008 0.0010 4.7297 5.0646 14.9412 24.9132 46.3813
frequency: -32.4171 24.9027 46.3271 56.7201 78.6171 85.6144 121.4289 153.5036 154.0889 163.4465 188.4589 215.6502 246.2723 336.8952 341.5111 354.0533 369.8122 402.0475 403.5749 450.3436 491.6215 496.2351 537.4755 541.4106 583.4043 598.2164 623.1789 639.1576 640.0580 669.4578 676.3180 685.6506 739.2765 753.3193 759.8727 762.0595 794.7009 829.1335 853.9276 866.7504 869.6290 928.2627 983.3837 994.7533 1000.7760 1008.2228 1017.7668 1026.3599 1033.9842 1055.9932 1131.0394 1192.1265 1201.0156 1216.4306 1225.5291 1274.8430 1306.0281 1335.4204 1356.8537 1367.7591 1369.0659 1379.3021 1380.4088 1429.3077 1437.0381 1449.9250 1468.3895 1483.2201 1503.8177 1555.0230 1566.9603 1594.0938 1622.9596 1638.9028 1644.8202 1675.6148 2989.5423 3061.7738 3074.2691 3115.6779 3132.9925 3139.1239 3160.2739 3199.8831 3513.5325 3533.3325 3537.4598
redmass: 1.0839 7.4828 5.3764 6.9782 6.3632 4.2589 5.0816 6.2851 7.4412 12.7193 8.3989 4.9912 5.4242 6.1353 5.7389 5.5097 9.4171 12.6099 3.1133 3.2762 6.1012 8.8420 2.5550 5.6023 2.8340 7.2247 8.0246 6.4701 2.4239 1.1905 5.6910 2.3923 1.8700 3.4421 2.3224 5.3819 3.9090 4.7782 1.2843 5.8199 1.5760 6.4838 1.7296 1.3282 3.4468 2.7154 1.4232 1.3301 1.6688 4.7959 1.4983 3.7430 1.5627 3.1472 2.1329 1.9355 1.8744 2.3807 2.9485 1.6348 2.4839 2.1478 1.8850 1.7190 2.7447 1.4158 1.0463 2.0814 2.4551 6.6704 3.9992 5.8258 5.6730 6.3982 5.6224 5.5021 1.0386 1.0856 1.0982 1.0907 1.0912 1.0980 1.0961 1.0948 1.0765 1.0767 1.0777
irintensity: 0.1442 0.0809 5.7536 1.6084 1.5441 4.2277 0.1442 0.0927 1.8556 8.6052 0.6571 0.0611 9.2610 0.9042 2.6970 29.7032 19.7250 2.4933 0.3628 0.0027 33.1476 22.6179 36.4796 42.2013 2.4176 6.8408 11.9260 3.3936 2.4745 58.4228 1.0134 36.5552 2.0500 20.4905 69.3236 11.9192 151.4071 0.2299 3.3711 8.7066 89.2572 1.3281 77.2019 11.3397 0.1734 7.5034 1.8748 6.1515 8.0400 7.6047 36.9060 154.7914 321.7992 273.0536 128.8492 96.3603 330.5224 73.1028 365.4867 2.5957 107.2345 251.5745 35.7952 50.4777 154.8857 129.6570 21.2439 1011.9883 279.6272 574.8940 58.6278 344.9748 139.6875 301.3459 114.0462 677.4655 5.4919 1.2742 12.1776 19.3904 4.6964 7.4757 50.8319 3.7927 20.9680 85.6925 95.1826
temp: 298.150 k
press: 1.00000 atm
elementType: 8 8 8 8 7 7 7 6 6 6 6 6 6 6 6 6 6 6 6 6 1 1 1 1 1 1 1 1 1 1 1
symmnumber: 1
zpe: 597638.7 jmol-1
zpe.correction: 0.227629 hartree
zpe.thermalcorrener: 0.244295 hartree
zpe.thermalcorrenthalpy: 0.245240 hartree
zpe.thermalcorrgfe: 0.181803 hartree
zpe.sumelectzpe: -965.791342 hartree
zpe.sumelectthermal: -965.774675 hartree
zpe.sumelectthermalent: -965.773731 hartree
zpe.sumelectthermalfe: -965.837168 hartree
dipole: 5.9873 -3.6825 -0.0077
dipole: 7.0291
quadrupole: -115.4219 -118.4332 -116.9394
quadrupole: -22.5885 0.0389 0.0126
quadrupole: 1.5096 -1.5017 -0.0079 -22.5885 0.0389 0.0126
hfenergy: -966.0189706 hartree
pointgroup: C01 [X(C13H11N3O4)]
dipole: 2.4194636 0.8160148 1.0621641 debye
polarizability: 444.9770505|-8.4629596|111.5228239|-8.6496696|48.9006193|135.8663575 unknown
InChI: InChI=1S/C13H11N3O4/c1-7(17)14-9-4-2-8(3-5-9)6-10-11(18)15-13(20)16-12(10)19/h2-6,14-16H,1H3
charge 0 multiplicity 1
31 atoms
O  -3.281551 -1.535577 -1.879229
O  -1.780579 1.323008 1.788494
O  -6.280704 0.673235 0.901473
O  5.590052 -1.023346 -1.194753
N  -4.73156 -0.419974 -0.472116
N  -3.988255 0.948629 1.282124
N  4.539522 0.267433 0.464971
C  0.352903 -0.26805 -0.233827
C  -2.294818 -0.155942 -0.108838
C  -1.03251 -0.527924 -0.575081
C  3.170454 0.054886 0.189581
C  1.326687 -0.918184 -1.066229
C  0.845705 0.557623 0.830185
C  2.705967 -0.772097 -0.874419
C  2.221456 0.709859 1.029919
C  -3.426551 -0.759554 -0.890107
C  -2.610538 0.735867 1.028819
C  -5.088671 0.418132 0.592839
C  5.667793 -0.251083 -0.200442
C  6.993516 0.215037 0.395684
H  -1.136448 -1.204119 -1.440663
H  0.976945 -1.555927 -1.887307
H  0.126475 1.06318 1.479047
H  3.427092 -1.275524 -1.519297
H  2.575114 1.34703 1.851119
H  -5.504024 -0.830417 -1.004957
H  -4.207688 1.567397 2.068713
H  4.735789 0.88455 1.258099
H  7.088711 1.315966 0.352276
H  7.814718 -0.232953 -0.181194
H  7.090796 -0.096762 1.452219
