program: Gaussian 09
title: 000256705
version: EM64L-G09RevD.01
frameworkgroup: C1[X(C11H11N3)]
method: RPBEPBE
basis: SDD
operation: Freq
keyword: #pfreq=noraman
keyword: PBEPBE/SDD
title: #p freq=noraman PBEPBE/SDD
converged: YES YES NO NO
title: Mulliken charges:
elementType: N N N C C C C C C C C C C C H H H H H H H H H H H
charge: -0.089892 -0.069162 -0.630949 0.327547 0.175909 -0.427770 -0.360919 -0.369975 -0.022954 0.185751 -0.247760 -0.233893 -0.235759 -0.754994 0.212197 0.212869 0.287996 0.225021 0.227433 0.228989 0.241907 0.236347 0.236097 0.314541 0.331421
chargesum: 0.00000
title: Mulliken charges with hydrogens summed into heavy atoms:
elementType: N N N C C C C C C C C C C C
charge: -0.089892 -0.069162 0.015014 0.327547 0.175909 -0.215572 -0.148050 -0.081979 -0.022954 0.185751 -0.022738 -0.006460 -0.006770 -0.040642
polarizability: 2.19565105e+02 7.88475726e+00 1.57976758e+02 -3.16995162e-02 -1.07631116e+00 6.04941220e+01
1716.lowfreq: -6.3868 -3.3895 -0.0008 -0.0004 -0.0003 4.1489 14.5314 46.8352 83.2057
frequency: 14.1475 46.8147 83.2051 130.1721 166.9377 203.6182 228.0389 264.8189 326.0742 339.2647 401.0884 412.8404 458.8003 509.2380 520.0848 544.2412 577.1198 605.0890 616.9859 652.4255 665.8203 697.0597 755.1841 787.8926 847.9422 852.0288 868.5695 931.6205 939.2278 969.9171 986.6778 987.9228 994.6878 1011.8126 1028.7467 1050.8606 1076.4171 1078.8798 1102.0079 1171.5145 1190.6834 1233.4612 1274.1312 1312.6514 1353.8997 1380.2200 1389.5852 1397.9138 1427.9825 1441.2579 1457.9513 1468.2122 1488.5725 1516.6986 1575.4899 1589.5318 1613.1149 1619.1451 2996.6482 3081.2955 3124.2243 3129.2754 3134.0533 3146.8705 3159.5154 3163.3929 3171.6674 3547.4042 3703.2999
redmass: 3.6926 1.0261 4.9549 4.1877 3.4078 4.3012 5.6261 3.3136 4.0870 4.0727 2.7692 1.1914 3.4588 3.1938 1.1344 7.1527 5.3064 2.7064 6.3975 6.2667 6.2571 1.6351 3.0173 1.8130 5.0639 1.4374 1.7342 8.1380 1.4634 2.1863 1.3766 4.0519 2.9710 1.3414 2.0657 1.6183 2.0644 1.6148 2.0290 1.0595 1.1377 2.2749 3.8510 1.5085 2.9955 1.9374 4.3113 2.6345 2.7941 2.6708 1.0675 1.2035 2.7659 6.1102 3.2265 6.2325 5.6682 1.5426 1.0383 1.0954 1.0846 1.1005 1.0882 1.0936 1.0966 1.0918 1.0981 1.0449 1.1046
irintensity: 0.6767 0.7918 1.3123 1.5213 2.6331 9.0008 0.0806 2.6574 2.3196 2.7675 1.2486 183.3702 4.6780 1.8799 112.0547 3.3196 10.4441 11.5154 0.1984 7.4699 0.0384 54.6329 9.4675 56.7568 8.8268 7.2266 20.4123 8.1756 3.0284 1.3876 0.3045 0.0614 2.6405 1.4255 9.7018 9.0919 11.6543 7.8865 0.7714 2.4436 11.7414 54.8296 14.4648 3.6782 8.1761 4.6321 18.7770 125.9866 13.2562 19.4204 15.2635 14.8712 37.8371 194.3134 339.0862 2.0580 14.7596 486.8278 11.1077 15.0137 1.3249 13.5865 8.5396 30.1675 11.4146 25.9452 18.8467 98.0041 32.4357
temp: 298.150 k
press: 1.00000 atm
elementType: 7 7 7 6 6 6 6 6 6 6 6 6 6 6 1 1 1 1 1 1 1 1 1 1 1
symmnumber: 1
zpe: 520339.3 jmol-1
zpe.correction: 0.198187 hartree
zpe.thermalcorrener: 0.210419 hartree
zpe.thermalcorrenthalpy: 0.211363 hartree
zpe.thermalcorrgfe: 0.158026 hartree
zpe.sumelectzpe: -589.062001 hartree
zpe.sumelectthermal: -589.049769 hartree
zpe.sumelectthermalent: -589.048824 hartree
zpe.sumelectthermalfe: -589.102161 hartree
dipole: -0.0804 -3.2594 -0.0593
dipole: 3.2609
quadrupole: -71.3939 -65.5902 -87.4422
quadrupole: 6.7056 0.0978 -0.2838
quadrupole: 3.4149 9.2185 -12.6335 6.7056 0.0978 -0.2838
hfenergy: -589.2601877 hartree
pointgroup: C01 [X(C11H11N3)]
dipole: 0.024678 -1.2801977 0.0802369 debye
dipolederiv: -1.2155507 -0.3545069 0.020296 -0.2700635 -0.7151849 0.0348647 0.0115311 0.0313544 -0.2112056 -0.6371313 -0.0311088 -0.0041989 0.2491965 -1.0508335 0.0680602 -0.0128631 0.0537707 -0.2513808 -0.8163997 0.6685334 -0.0488797 0.8166712 -0.9795372 0.0287904 -0.06152 0.0283717 -0.7248336 -0.2113594 -0.0121254 0.0033761 -0.028251 -0.0175837 -0.00078 0.0047799 -0.0080485 -0.0134613 1.2864826 -0.0260473 0.0112238 -0.0894582 0.5693428 -0.0440074 0.0239998 -0.0245644 0.0873992 -1.0191736 0.4962271 -0.0463147 0.2464655 -0.2993817 0.0053175 -0.0321535 0.0071158 -0.1839363 -0.0121124 -0.0640953 -0.0068241 0.0491403 0.0198851 0.0128394 -0.0163143 0.0105358 -0.1466584 -0.0796887 0.0954565 0.0042341 -0.0306986 -0.0151504 0.0049255 0.0122981 0.0004793 -0.1233137 0.9397339 0.2798682 -0.0156802 0.2174849 1.0112033 -0.0786374 -0.0413163 -0.1017002 0.057209 1.2841416 -0.7963481 0.0659849 -0.7922872 1.2556757 -0.0851551 0.0721952 -0.0790169 0.2196577 -0.1041715 0.1096676 0.0053194 0.2085584 0.0639704 0.0105398 0.0109939 0.0091143 -0.1578178 -0.0498083 -0.1305923 -0.0036224 -0.1778541 0.1134722 0.0060946 -0.0071698 0.0057312 -0.1575648 0.0487622 0.0041796 0.00157 -0.0461779 -0.0233832 0.0035106 -0.0005656 0.0053343 -0.157348 0.007091 -0.0878509 0.0104212 -0.2045691 -0.308843 0.0289658 0.0551402 0.0852617 0.0124853 0.0712133 -0.0844181 0.0068449 -0.0940203 -0.0778867 0.0199306 0.00849 0.0178277 0.1638639 0.0670439 0.1088206 0.0043794 0.0938567 -0.0629168 -0.0090814 0.0058779 -0.005629 0.1421875 0.1652597 -0.0754535 -0.0056623 -0.0642852 0.0228795 -0.0062414 -0.0090601 -0.0014698 0.1493751 -0.0013007 -0.0869424 -0.0047838 -0.121751 -0.0691917 -0.0096972 -0.0046389 -0.0100187 0.1583136 0.012696 0.0830454 0.0010618 0.1150733 -0.0815504 -0.0062739 0.0018532 -0.006805 0.1553525 -0.1499297 0.0097302 -0.0028372 0.007122 0.0927408 -0.002314 -0.0032589 -0.0015678 0.1608105 -0.1139192 -0.0393989 -0.036088 0.0555955 0.0914439 0.0120434 -0.0492157 -0.0121632 0.1121555 0.0829367 -0.0177152 -0.0440548 -0.0256474 0.0500768 0.0610671 -0.009754 0.0888599 -0.0739955 0.0518519 0.0474143 0.0813124 0.0129947 0.0120191 -0.0780415 0.0349784 -0.1149943 0.0200533 0.148281 -0.0483934 0.0006922 -0.087281 0.2125827 0.0106889 0.0042491 0.0094468 0.3847984 0.2450514 -0.0479463 0.0022301 -0.0398147 0.186151 0.012591 0.0014431 0.0127741 0.3778544 unknown
polarizability: 219.4659477|-8.1417236|157.9585285|1.8938305|-3.3155299|60.6115088 unknown
InChI: InChI=1S/C11H11N3/c1-8-13-10(7-11(12)14-8)9-5-3-2-4-6-9/h2-7H,12H2,1H3
charge 0 multiplicity 1
25 atoms
N  0.87744 1.131026 -0.041574
N  3.048823 0.038356 0.051267
N  3.240859 -2.281498 0.216171
C  -1.248388 -0.07504 0.014606
C  0.245052 -0.095276 0.032825
C  0.995273 -1.287686 0.12622
C  -2.026127 -1.264243 -0.032938
C  -1.923675 1.175738 0.042297
C  2.242496 1.139644 -0.029003
C  2.415543 -1.179932 0.130343
C  -3.435174 -1.204738 -0.046325
C  -3.332024 1.235424 0.03044
C  -4.096172 0.045574 -0.012744
C  2.92135 2.484658 -0.126721
H  0.51867 -2.268014 0.20329
H  -1.542782 -2.246272 -0.069711
H  -1.311762 2.081996 0.069955
H  -4.018034 -2.131831 -0.085906
H  -3.835167 2.208541 0.054391
H  -5.191011 0.090472 -0.022732
H  3.999903 2.381646 0.064206
H  2.774687 2.91184 -1.136063
H  2.474266 3.192972 0.59148
H  2.871659 -3.225849 0.276977
H  4.246595 -2.123609 0.213851
