program: Gaussian 09
title: 000263499
version: EM64L-G09RevD.01
frameworkgroup: C1[X(C13H14N4O3)]
method: RPBEPBE
basis: SDD
operation: Freq
keyword: #p
keyword: freq=noraman
keyword: PBEPBE/SDD
title: #p freq=noraman PBEPBE/SDD
converged: NO YES NO NO
title: Mulliken charges:
elementType: O O O N N N N C C C C C C C C C C C C C H H H H H H H H H H H H H H
charge: -0.320025 -0.437074 -0.236067 -0.455997 -0.407183 0.026126 0.066564 0.504077 0.430009 -0.501089 0.208342 0.163594 -0.408915 0.184421 -0.305756 -0.432312 -0.398242 -0.792170 0.020943 -0.523891 0.246103 0.298648 0.288374 0.244935 0.250355 0.202464 0.238297 0.260114 0.238247 0.260326 0.380759 0.230973 0.230972 0.244079
chargesum: 0.00000
title: Mulliken charges with hydrogens summed into heavy atoms:
elementType: O O O N N N N C C C C C C C C C C C C C
charge: -0.320025 -0.056315 -0.236067 -0.157350 -0.146857 0.026126 0.066564 0.504077 0.430009 -0.254985 0.208342 0.163594 -0.120541 0.184421 -0.060822 -0.181957 -0.195779 -0.055512 0.020943 0.182133
polarizability: 3.84562731e+02 3.21285812e+00 2.07281545e+02 -5.90272049e-03 8.05182732e-03 8.09471982e+01
1716.lowfreq: -5.6373 -2.0003 -0.0009 0.0003 0.0010 4.6337 16.5288 30.2199 33.0103
frequency: 16.5094 30.1975 32.9990 69.2046 87.8172 106.1603 120.4105 125.6795 158.3741 177.4426 187.0131 194.8767 205.1254 214.5912 226.2716 286.8694 290.3480 313.7720 356.8559 387.5063 445.0836 450.1692 469.8248 478.5207 483.1541 490.1526 509.8564 545.1803 572.7305 573.2358 579.1258 616.7552 623.1125 666.2833 693.0888 725.0733 733.2147 733.5146 798.3067 818.4433 862.6145 866.6671 867.4579 935.3497 942.9588 961.8811 963.7968 987.7922 992.1164 1051.5261 1060.5422 1098.6394 1116.3472 1118.4597 1150.2674 1154.8615 1169.3104 1196.1009 1220.0017 1231.5838 1244.4193 1262.1899 1312.4811 1336.9968 1351.2151 1396.0375 1404.4546 1419.6487 1439.1218 1462.5996 1466.2284 1466.5511 1469.9817 1474.6676 1499.8350 1539.8927 1557.9527 1574.0320 1599.1520 1618.0509 1629.7540 1660.8199 2952.3515 2972.9202 2977.7472 3052.8810 3065.0898 3116.8331 3131.5133 3149.7772 3154.0986 3174.2746 3188.0127 3355.0831 3515.7717 3521.8310
redmass: 4.6980 5.6295 6.1483 3.7352 2.3436 2.1688 1.9755 5.5921 3.1238 4.1111 5.8298 2.6055 3.8783 2.7164 1.7327 4.4003 4.3301 4.2821 5.1399 4.0861 2.7608 8.0357 1.4752 6.1681 6.5414 1.1146 5.3371 4.0950 1.2371 5.7746 6.0212 4.2773 5.9618 6.3283 5.7958 3.4812 4.1804 5.5078 5.7490 1.3640 1.4807 1.5011 6.1293 1.5268 3.1228 1.3642 3.4490 2.4337 7.6421 1.5197 2.8686 4.0971 1.2550 2.5649 1.4295 2.8363 1.4986 1.5483 2.0318 1.8554 2.0292 2.1628 1.6816 2.0526 2.0990 4.7369 1.3036 3.0084 1.2065 2.6406 1.0434 1.0492 1.1760 1.1494 2.8649 2.3478 3.0624 7.3508 6.3198 7.1135 6.5124 6.3795 1.0865 1.0321 1.0393 1.0980 1.1047 1.0964 1.1007 1.0918 1.0879 1.0967 1.0936 1.0744 1.0645 1.0777
irintensity: 9.9868 0.0892 7.6400 2.1112 3.9784 2.6309 0.0687 0.2823 1.7725 13.4876 2.8812 2.6477 0.4473 2.2534 4.3459 0.0015 2.9377 7.1921 9.6321 0.6144 14.5878 0.5377 6.3478 18.5427 0.2756 141.5708 13.3228 0.8605 177.5409 18.2719 8.1235 12.1668 13.4651 0.1223 3.0721 5.0487 1.1832 30.2359 12.7999 36.1576 32.7570 14.9450 3.0183 40.3811 61.5244 6.9221 2.6737 13.0342 59.4342 8.6445 22.2273 66.1808 0.1312 160.9553 2.7629 3.7430 99.3790 90.4161 332.6170 100.2314 332.1087 221.8079 57.9957 55.7952 10.7467 24.3538 28.8787 70.2939 24.7213 8.2346 18.0760 15.3697 31.0558 96.5580 311.1234 600.6983 497.0795 24.1962 19.3594 327.8269 34.8862 238.5763 72.2908 68.9343 28.5901 17.4792 40.3752 10.5693 23.4892 6.7799 6.1990 5.2639 4.7363 39.5290 91.1483 18.6780
temp: 298.150 k
press: 1.00000 atm
elementType: 8 8 8 7 7 7 7 6 6 6 6 6 6 6 6 6 6 6 6 6 1 1 1 1 1 1 1 1 1 1 1 1 1 1
symmnumber: 1
zpe: 676221.4 jmol-1
zpe.correction: 0.257559 hartree
zpe.thermalcorrener: 0.276876 hartree
zpe.thermalcorrenthalpy: 0.277820 hartree
zpe.thermalcorrgfe: 0.207941 hartree
zpe.sumelectzpe: -946.962231 hartree
zpe.sumelectthermal: -946.942915 hartree
zpe.sumelectthermalent: -946.941971 hartree
zpe.sumelectthermalfe: -947.011849 hartree
dipole: 0.6210 -6.8377 -0.0004
dipole: 6.8659
quadrupole: -74.5364 -117.1374 -120.7715
quadrupole: 54.4442 0.0029 -0.0090
quadrupole: 29.6121 -12.9890 -16.6231 54.4442 0.0029 -0.0090
hfenergy: -947.2197904 hartree
pointgroup: C01 [X(C13H14N4O3)]
dipole: 0.3276383 -2.6812976 0.0004086 debye
polarizability: 384.1929438|8.7029645|207.6513282|0.0309065|-0.0162064|80.947203 unknown
InChI: InChI=1S/C13H14N4O3/c1-8-5-12(19)16-13(15-8)17-14-7-9-3-4-11(20-2)10(18)6-9/h3-7,15,17-18H,1-2H3
charge 0 multiplicity 1
34 atoms
O  5.888316 0.841956 0.000145
O  5.486664 -1.805754 0.0004
O  -4.23008 2.845546 -0.00054
N  -4.045293 -1.232153 -0.001582
N  -1.699996 -1.153386 -0.00141
N  -2.918265 0.896577 -0.002804
N  -0.480126 -0.510459 -0.001235
C  1.937346 -0.666277 -0.000615
C  -5.318866 -0.635221 -0.000992
C  3.077383 -1.51865 -0.000224
C  4.535491 0.447184 -0.00013
C  4.366724 -0.967574 0.000017
C  2.116395 0.745008 -0.000759
C  -2.893926 -0.41868 -0.001977
C  3.411233 1.300263 -0.000519
C  -5.394674 0.737057 -0.001663
C  0.599654 -1.26536 -0.000873
C  -6.495569 -1.579273 0.000677
C  -4.17768 1.580296 -0.004231
C  6.178956 2.277875 0.000069
H  2.973872 -2.609056 -0.000109
H  -3.976255 -2.251862 -0.000802
H  1.230368 1.386613 -0.001075
H  3.534351 2.387337 -0.000639
H  -6.363743 1.240659 -0.000632
H  0.549503 -2.375246 -0.00073
H  -6.493273 -2.231679 -0.893604
H  -7.437272 -1.009923 0.001315
H  -6.491478 -2.230684 0.895673
H  -1.746832 -2.184643 -0.001232
H  6.301582 -1.236014 0.000514
H  5.767671 2.763006 0.905088
H  5.768159 2.76281 -0.905277
H  7.275858 2.354204 0.000356
