program: Gaussian 09
title: 000263508
version: EM64L-G09RevD.01
frameworkgroup: C1[X(C16H20N4O3)]
method: RPBEPBE
basis: SDD
operation: Freq
keyword: #p
keyword: freq=noraman
keyword: PBEPBE/SDD
title: #p freq=noraman PBEPBE/SDD
converged: YES YES NO NO
title: Mulliken charges:
elementType: O O O N N N N C C C C C C C C C C C C C C C C H H H H H H H H H H H H H H H H H H H H
charge: -0.239801 -0.229174 -0.241854 -0.423857 -0.376378 -0.038257 -0.043485 0.223574 0.204707 0.515561 -0.511908 -0.339438 -0.428375 -0.243532 -0.409012 -0.247100 0.440135 0.167294 -0.682191 -0.439190 -0.681188 -0.786680 0.007172 0.266902 0.251548 0.225414 0.207368 0.207826 0.220295 0.211266 0.211064 0.343678 0.249816 0.204789 0.235275 0.235143 0.323201 0.207462 0.235065 0.235080 0.238215 0.255476 0.238094
chargesum: 0.00000
title: Mulliken charges with hydrogens summed into heavy atoms:
elementType: O O O N N N N C C C C C C C C C C C C C C C C
charge: -0.239801 -0.229174 -0.241854 -0.080178 -0.053177 -0.038257 -0.043485 0.223574 0.204707 0.515561 -0.245006 -0.087890 -0.202961 0.171662 -0.188717 0.175230 0.440135 0.167294 -0.006984 -0.189374 -0.003580 -0.054896 0.007172
polarizability: 4.72249185e+02 -4.21591214e-01 2.35787667e+02 1.57236558e-01 -4.56291048e-02 1.07674418e+02
1716.lowfreq: -2.2846 -0.0006 -0.0002 0.0005 0.5993 2.9628 13.8917 25.8972 28.2012
frequency: 13.8856 25.8446 28.1886 55.1579 67.4806 90.1187 95.9671 100.7352 106.2219 116.2777 124.3486 146.0373 168.8717 171.7348 192.3920 212.1767 222.4102 238.8288 245.0121 253.3496 278.4102 299.6483 309.9276 320.1692 338.2291 370.9629 405.6000 463.8868 477.2631 486.3691 510.8711 549.3431 554.9846 559.0629 584.4059 595.2532 626.0593 642.4718 665.7822 693.2038 718.0720 739.7668 742.0282 750.0203 769.3211 798.7908 824.5523 834.1381 864.0940 873.0016 874.6581 879.0680 900.5050 911.7308 941.7734 951.5575 990.6021 1012.2724 1030.5635 1032.7482 1040.9745 1052.9024 1096.6881 1114.1268 1116.5216 1133.6701 1134.3851 1135.0793 1150.4318 1179.6938 1214.9600 1224.1993 1259.4433 1262.5809 1266.1564 1267.5551 1280.4762 1330.8715 1359.8153 1368.0702 1381.2968 1395.8851 1400.2108 1403.0541 1406.7001 1432.9569 1453.8128 1459.9664 1460.3081 1461.0946 1465.4443 1475.9022 1476.2942 1483.9958 1486.7359 1488.2729 1507.5820 1556.5746 1567.8000 1592.8871 1606.2590 1624.6749 1654.8023 2949.5110 2957.7086 2978.4326 2998.1716 2999.6003 3003.2566 3007.9791 3017.6265 3054.0378 3095.1713 3096.9129 3108.8988 3109.9751 3115.0900 3131.4595 3169.3625 3173.3011 3186.7664 3445.7684 3495.4227
redmass: 4.0375 5.7570 5.0679 4.8802 3.3104 3.8136 2.6507 4.0290 1.3100 1.9032 1.9361 3.3132 5.3470 4.6185 3.8458 4.6628 5.5443 1.2527 1.2739 2.9849 3.3399 5.6167 4.0657 4.0483 5.5743 3.9183 5.1422 3.0681 5.5917 6.5355 5.3323 3.8939 7.5241 5.6664 5.5965 1.2024 3.7251 5.8732 3.0627 5.9036 1.4506 3.7973 2.8474 4.5077 4.5737 1.4175 1.1238 1.1182 1.4639 1.5134 5.6059 3.4978 3.4469 1.3747 1.5491 2.3075 3.2140 3.5012 2.6870 2.6088 2.2564 1.5265 4.5547 2.2862 2.2104 2.2803 1.4351 1.4407 3.0260 1.9536 1.8075 2.0856 1.1451 3.2710 1.1414 1.4730 1.5384 1.6294 1.4214 1.3438 2.5311 1.6883 1.2692 1.3853 2.1400 4.3006 2.7383 1.0397 1.0395 1.5151 1.0438 1.1157 1.1081 1.7452 1.1394 1.1074 2.5233 5.5272 7.7014 6.1946 6.3738 5.4372 6.8303 1.0551 1.0553 1.0389 1.0364 1.0364 1.0876 1.1075 1.1076 1.0979 1.0988 1.0989 1.1014 1.1014 1.0969 1.0894 1.0906 1.0932 1.0935 1.0766 1.0775
irintensity: 1.4341 2.4017 1.5455 3.5433 4.4639 4.6741 3.3390 2.8002 0.2191 1.8810 0.0051 1.5871 5.4642 0.0825 0.1781 3.8095 0.8395 2.1545 0.4008 4.7818 2.3137 12.9145 7.9582 9.5482 8.2274 17.1197 0.4608 1.7257 1.3528 3.2442 1.9951 0.3051 4.0441 10.1340 4.4620 104.6657 28.0747 34.9267 0.0027 4.4538 76.4652 0.1216 4.1610 13.6160 1.7656 38.2270 11.5463 0.0425 32.4070 12.0906 49.1161 17.4765 61.2537 16.0724 30.1665 12.9365 13.8908 10.9848 104.8073 33.9652 70.7686 9.9017 311.5295 0.6273 4.2189 199.0245 4.0919 7.6442 15.9490 45.1419 45.1485 127.4605 0.1125 595.6077 0.0204 26.0729 31.0948 53.7979 11.4779 11.9768 22.3743 47.6906 10.7373 47.9752 7.4954 49.2171 366.5657 0.9401 23.0423 28.9809 18.0464 31.6315 35.5340 119.3605 44.1756 18.5433 202.8656 1237.5156 23.7924 23.6599 88.9733 276.9254 427.3163 32.7694 48.0737 19.2222 23.8764 32.3144 44.6351 35.0780 34.6231 16.8169 27.0388 25.8749 26.4392 35.7884 13.0906 12.6612 11.5992 15.8352 4.0742 17.7206 111.9254
temp: 298.150 k
press: 1.00000 atm
elementType: 8 8 8 7 7 7 7 6 6 6 6 6 6 6 6 6 6 6 6 6 6 6 6 1 1 1 1 1 1 1 1 1 1 1 1 1 1 1 1 1 1 1 1
symmnumber: 1
zpe: 898226.7 jmol-1
zpe.correction: 0.342116 hartree
zpe.thermalcorrener: 0.365395 hartree
zpe.thermalcorrenthalpy: 0.366339 hartree
zpe.thermalcorrgfe: 0.287181 hartree
zpe.sumelectzpe: -1064.645434 hartree
zpe.sumelectthermal: -1064.622156 hartree
zpe.sumelectthermalent: -1064.621211 hartree
zpe.sumelectthermalfe: -1064.700370 hartree
dipole: -10.2584 3.0152 -0.0129
dipole: 10.6924
quadrupole: -192.0675 -114.0137 -139.4120
quadrupole: 37.8749 -0.3034 0.0064
quadrupole: -43.5698 34.4840 9.0857 37.8749 -0.3034 0.0064
hfenergy: -1064.9875509 hartree
pointgroup: C01 [X(C16H20N4O3)]
dipole: 3.9034382 -1.1967802 -1.013495 debye
polarizability: 467.9984574|-4.5196417|207.1358158|-35.6474134|54.485234|140.5769969 unknown
InChI: InChI=1S/C16H20N4O3/c1-4-22-13-7-6-12(9-14(13)23-5-2)10-17-20-16-18-11(3)8-15(21)19-16/h6-10,18,20H,4-5H2,1-3H3
charge 0 multiplicity 1
43 atoms
O  2.887593 -1.299342 -0.728926
O  4.971671 0.193496 -0.098816
O  -7.203058 1.480829 1.732719
N  -3.580045 -0.014222 0.566631
N  -2.535635 1.88042 1.494357
N  -1.327334 1.343526 1.090374
N  -4.865004 1.725498 1.635487
C  2.593467 -0.11149 -0.056731
C  3.732942 0.699846 0.284961
C  1.102437 1.551159 0.98155
C  1.302186 0.317805 0.291427
C  3.532035 1.920418 0.967521
C  2.230063 2.341604 1.312385
C  1.75555 -2.171776 -1.100875
C  -0.22749 2.023613 1.359233
C  6.174525 0.988779 0.233211
C  -4.722445 -0.770846 0.26722
C  -3.721881 1.194645 1.23625
C  2.353378 -3.387521 -1.803201
C  -5.947446 -0.277266 0.655735
C  7.373377 0.203539 -0.289904
C  -4.490854 -2.070003 -0.463031
C  -6.082397 1.015468 1.370084
H  0.423373 -0.282042 0.042673
H  4.385882 2.548771 1.234279
H  2.092782 3.29128 1.842624
H  1.200804 -2.46519 -0.185324
H  1.067161 -1.61498 -1.770264
H  -0.272062 2.993211 1.891135
H  6.099969 1.984885 -0.249453
H  6.22912 1.128379 1.332416
H  -2.627833 -0.301255 0.318213
H  -6.863314 -0.833375 0.443386
H  1.550496 -4.082702 -2.109442
H  2.913902 -3.079924 -2.70203
H  3.044577 -3.923084 -1.130814
H  -2.629963 2.775807 1.991773
H  8.308914 0.749157 -0.06966
H  7.425031 -0.789782 0.186837
H  7.298258 0.060524 -1.381034
H  -4.00071 -1.899189 -1.440619
H  -5.448604 -2.580369 -0.646502
H  -3.845718 -2.751698 0.123648
