program: Gaussian 09
title: 000263509
version: EM64L-G09RevD.01
frameworkgroup: C1[X(C16H21N5O)]
method: RPBEPBE
basis: SDD
operation: Freq
keyword: #p
keyword: freq=noraman
keyword: PBEPBE/SDD
title: #p freq=noraman PBEPBE/SDD
converged: YES YES NO NO
title: Mulliken charges:
elementType: O N N N N N C C C C C C C C C C C C C C C C H H H H H H H H H H H H H H H H H H H H H
charge: -0.246423 -0.166319 -0.424637 -0.043387 -0.375246 -0.044473 -0.375652 -0.376141 0.462168 -0.368587 -0.353405 -0.665101 -0.664871 0.481409 -0.416610 -0.409552 -0.403226 0.439221 0.164583 -0.442218 -0.786177 0.005449 0.222730 0.210785 0.211305 0.222067 0.231704 0.229331 0.219390 0.242799 0.218114 0.242599 0.219619 0.217826 0.220406 0.240457 0.215279 0.346297 0.320008 0.248455 0.238333 0.253356 0.238334
chargesum: 0.00000
title: Mulliken charges with hydrogens summed into heavy atoms:
elementType: O N N N N N C C C C C C C C C C C C C C C C
charge: -0.246423 -0.166319 -0.078339 -0.043387 -0.055238 -0.044473 0.057863 0.057232 0.462168 -0.136883 -0.124074 0.015203 0.015173 0.481409 -0.196204 -0.169096 -0.187947 0.439221 0.164583 -0.193763 -0.056155 0.005449
polarizability: 5.15525999e+02 1.95814939e+01 2.17618149e+02 -8.94686894e+00 -3.89070995e+00 1.11112008e+02
1716.lowfreq: -6.1615 -0.0007 -0.0002 0.0003 3.0657 3.7386 19.6079 25.5255 31.8217
frequency: 19.5930 25.4746 31.7793 44.0388 62.3771 98.2130 106.6635 111.1209 117.2935 135.3175 148.0442 169.7533 182.2637 195.3212 211.1778 212.6352 237.6766 265.0408 275.9998 291.9815 316.8352 358.0584 371.8830 408.9667 422.2156 451.1084 478.1687 489.8135 502.9815 530.3944 538.4503 549.4468 555.3096 586.1809 598.8954 633.6877 665.7422 689.7029 717.6193 724.2285 737.7848 739.9352 780.6085 785.1853 806.8687 821.9323 863.1210 863.3294 876.5828 893.9016 916.4060 920.7057 952.9336 954.6058 964.6158 993.8908 1010.2561 1020.5499 1040.6362 1053.0542 1067.0382 1084.0970 1092.0494 1093.1920 1136.1715 1153.1198 1158.6564 1199.3008 1203.0775 1215.5091 1257.9039 1270.4238 1275.5604 1292.1049 1318.3997 1334.5029 1340.4962 1347.8673 1371.1086 1384.4120 1386.5913 1391.9093 1397.9896 1404.1947 1448.0852 1453.2111 1459.9410 1463.1732 1465.5705 1471.7827 1475.2376 1483.0858 1486.2977 1488.2795 1502.8009 1524.7032 1546.6115 1555.2979 1586.9644 1623.3558 1632.2375 1654.2410 2978.0828 2986.7412 2987.9374 2988.4711 2992.0873 2993.4395 3041.7994 3048.7837 3053.6403 3082.0167 3084.7964 3094.2751 3098.4571 3114.6507 3116.0823 3142.1579 3167.7329 3172.1819 3186.9194 3447.2893 3487.9240
redmass: 3.6541 5.8210 4.8449 3.0007 4.8959 3.7360 2.7508 1.3544 3.8697 3.3590 3.1511 2.8756 1.6151 2.2273 2.7733 1.5013 4.5234 2.4597 4.0673 2.7214 3.6560 4.8690 4.4200 3.6603 3.1018 3.4532 3.7845 5.7104 2.8831 3.2310 2.7342 3.7517 8.2253 1.2015 4.4002 6.8974 3.3194 4.9858 4.7428 1.4818 3.3377 3.4953 1.1346 1.2357 1.2745 1.7024 1.4643 4.5615 6.1956 2.2310 2.0561 1.4533 2.3331 1.4439 1.3590 2.8878 3.8361 3.0944 2.2504 1.5272 2.1472 1.9101 2.9432 1.9099 1.6015 2.9345 1.9486 1.3417 1.7608 1.7967 1.7302 1.6702 1.4138 1.2448 1.6398 1.4140 1.2465 1.3958 3.1438 1.9184 1.4838 1.2243 1.8468 1.4466 3.7187 3.6195 1.3951 1.0580 1.0438 1.0472 1.0695 1.7381 1.0552 1.0905 1.1277 3.0887 6.8494 5.6126 6.0078 5.4897 6.1220 6.8690 1.0389 1.0395 1.0409 1.0536 1.0637 1.0859 1.1011 1.0995 1.0979 1.0993 1.0983 1.1012 1.1011 1.0969 1.0894 1.0874 1.0934 1.0936 1.0934 1.0766 1.0776
irintensity: 1.1767 2.3695 0.9043 0.0591 1.6182 2.8199 0.2097 0.6716 2.4751 8.8286 1.8994 0.4853 1.1157 0.6393 0.0226 0.6393 1.5629 7.2842 18.1433 2.3052 15.5880 18.9831 4.4500 3.8603 0.4465 12.9239 9.6692 1.7460 3.5954 14.3647 5.5588 0.0144 0.0050 128.9075 3.4880 1.0969 0.0181 14.0280 3.2369 75.9307 6.6858 0.0382 4.3258 21.0447 3.7823 60.4726 34.4900 0.9926 57.6119 0.0653 4.5432 22.5331 16.6086 13.8205 1.4836 1.1357 14.5021 65.2143 69.5790 9.9245 0.1868 108.4656 203.4875 39.4301 23.1724 8.7598 16.0149 89.4668 65.1905 61.9465 39.1271 142.3655 64.5725 5.6145 43.6129 3.1602 10.1343 227.8386 0.1338 45.3109 15.5938 47.5159 99.3130 30.7993 31.5701 348.4610 28.6668 3.5582 17.2713 11.0235 0.5590 113.2081 2.7122 11.4286 22.9252 462.7946 44.8122 1316.9589 2.2209 496.3635 276.6829 399.2970 19.0709 4.2617 49.6509 48.2393 115.8890 32.5980 3.6874 25.6452 17.0459 57.5226 56.0603 7.7445 72.9060 13.8392 14.4827 6.7974 25.7109 21.5824 4.7231 15.9754 119.3241
temp: 298.150 k
press: 1.00000 atm
elementType: 8 7 7 7 7 7 6 6 6 6 6 6 6 6 6 6 6 6 6 6 6 6 1 1 1 1 1 1 1 1 1 1 1 1 1 1 1 1 1 1 1 1 1
symmnumber: 1
zpe: 922861.4 jmol-1
zpe.correction: 0.351499 hartree
zpe.thermalcorrener: 0.373466 hartree
zpe.thermalcorrenthalpy: 0.374411 hartree
zpe.thermalcorrgfe: 0.298518 hartree
zpe.sumelectzpe: -969.644627 hartree
zpe.sumelectthermal: -969.622660 hartree
zpe.sumelectthermalent: -969.621716 hartree
zpe.sumelectthermalfe: -969.697608 hartree
dipole: 13.5579 4.3849 -0.6262
dipole: 14.2631
quadrupole: -175.2560 -113.6915 -136.5072
quadrupole: -26.2139 2.6799 -0.4871
quadrupole: -33.4378 28.1267 5.3111 -26.2139 2.6799 -0.4871
hfenergy: -969.9961262 hartree
pointgroup: C01 [X(C16H21N5O1)]
dipole: 5.0115237 -1.833006 1.7361018 debye
polarizability: 502.2812237|-38.5053741|187.160093|53.4287627|-56.8782691|154.8148396 unknown
InChI: InChI=1S/C16H21N5O/c1-4-21(5-2)14-8-6-13(7-9-14)11-17-20-16-18-12(3)10-15(22)19-16/h6-11,18,20H,4-5H2,1-3H3
charge 0 multiplicity 1
43 atoms
O  -7.185007 1.87536 -1.861876
N  4.81911 -0.097069 0.812874
N  -3.764491 0.262278 -0.306451
N  -1.3793 1.320333 -0.887873
N  -2.51237 1.903146 -1.431897
N  -4.840025 1.931767 -1.677983
C  6.08877 0.555995 0.426822
C  4.894549 -1.310665 1.655146
C  3.595713 0.355874 0.308209
C  3.512944 1.501424 -0.551101
C  2.358021 -0.295848 0.643118
C  6.626268 0.146618 -0.966303
C  4.8483 -2.643653 0.868599
C  1.050991 1.33316 -0.667085
C  2.275153 1.971105 -1.014308
C  1.130646 0.18455 0.173437
C  -0.207693 1.860152 -1.178625
C  -4.982037 -0.341957 0.036128
C  -3.766405 1.368905 -1.147156
C  -6.140011 0.193101 -0.482025
C  -4.900641 -1.5369 0.952997
C  -6.125773 1.374536 -1.378848
H  5.961685 1.654597 0.473313
H  6.840309 0.300985 1.196145
H  5.838178 -1.258601 2.228355
H  4.079483 -1.287088 2.403388
H  4.418026 2.030589 -0.859779
H  2.358315 -1.1857 1.278178
H  6.852544 -0.933322 -1.002481
H  5.891505 0.366045 -1.760201
H  7.556064 0.700364 -1.194332
H  3.931663 -2.716032 0.257917
H  5.715238 -2.735857 0.191243
H  4.866242 -3.500243 1.567933
H  2.25487 2.854159 -1.66615
H  0.205118 -0.331483 0.449799
H  -0.140066 2.750843 -1.833513
H  -2.851687 -0.06394 0.028628
H  -2.49703 2.723847 -2.051407
H  -7.111194 -0.245383 -0.241746
H  -4.301344 -2.350114 0.500706
H  -5.908418 -1.928633 1.158981
H  -4.431313 -1.270445 1.919324
