program: Gaussian 09
title: 000263532
version: EM64L-G09RevD.01
frameworkgroup: C1[X(C16H20O4)]
method: RPBEPBE
basis: SDD
operation: Freq
keyword: #pfreq=noraman
keyword: PBEPBE/SDD
title: #p freq=noraman PBEPBE/SDD
converged: YES YES NO NO
title: Mulliken charges:
elementType: O O O O C C C C C C C C C C C C C C C C H H H H H H H H H H H H H H H H H H H H
charge: -0.325621 -0.402113 -0.153154 -0.254145 0.342034 0.307896 -0.563677 -0.594151 -0.036828 -0.003405 -0.082108 -0.127686 -0.421491 -0.299529 0.378409 0.385006 -0.776314 -0.779747 -0.788420 -0.804127 0.237820 0.274707 0.232525 0.240061 0.275673 0.248365 0.227659 0.236053 0.228066 0.232783 0.235761 0.229799 0.215875 0.230935 0.215117 0.254845 0.217821 0.214374 0.365673 0.385258
chargesum: 0.00000
title: Mulliken charges with hydrogens summed into heavy atoms:
elementType: O O O O C C C C C C C C C C C C C C C C
charge: 0.040052 -0.016856 -0.153154 -0.254145 0.342034 0.307896 -0.051149 -0.121565 -0.036828 -0.003405 -0.082108 -0.127686 -0.145818 -0.051164 0.378409 0.385006 -0.084537 -0.081403 -0.126492 -0.117087
polarizability: 2.69649698e+02 -7.21170758e+00 2.02488946e+02 -9.09950576e+00 1.63457351e+01 1.37311640e+02
1716.lowfreq: -5.6053 -3.6641 -0.0006 -0.0005 0.0008 5.1556 21.3434 30.5643 39.3967
frequency: 21.0584 30.4820 39.2973 45.4031 53.5445 73.7970 88.9302 105.8572 113.2129 126.0164 138.3341 168.8104 173.9159 186.6323 198.0522 216.7519 256.3393 271.8051 288.5317 316.7856 327.4978 342.5726 349.2320 386.3404 389.9658 410.1583 420.5695 439.2221 460.1757 474.6281 478.6215 502.3146 525.6027 563.0518 631.2425 641.8689 686.3132 715.2963 733.0632 739.8631 766.6256 788.1711 820.8226 858.4370 871.8755 884.3802 925.3124 941.2661 950.1223 952.2857 981.3662 995.1701 1003.5264 1012.7524 1033.0301 1040.8018 1081.4139 1082.9544 1111.2825 1117.8247 1147.1980 1175.5443 1193.8660 1226.7839 1230.7017 1246.3067 1259.0895 1288.6829 1293.8671 1334.3877 1347.2825 1354.3783 1359.9699 1388.1937 1393.1806 1399.7473 1400.4226 1404.8074 1449.3459 1449.3926 1454.4020 1456.1428 1465.6176 1467.5174 1470.4885 1471.3812 1475.5830 1484.5714 1519.0792 1546.3716 1584.4817 1667.7376 1673.1223 1689.6368 2957.3969 2964.2429 2968.2315 2974.2064 2985.7002 3004.6532 3028.7602 3032.2246 3032.3499 3042.4417 3046.3013 3080.7801 3083.5428 3083.9118 3090.0926 3099.3568 3101.1464 3107.6708 3153.2478 3285.2657
redmass: 3.9992 3.8513 3.2427 3.8029 3.0834 3.5295 6.8019 1.1949 3.4855 1.0786 6.1424 1.2359 1.6047 2.6789 3.4182 3.4498 3.0798 3.6374 2.2099 4.1759 2.4345 5.1782 5.3125 2.7438 3.3792 6.2518 3.5724 3.0169 3.8722 3.7987 3.8624 4.1940 3.2804 4.5507 5.1652 5.2472 1.3339 2.8290 1.3560 3.0909 2.7862 2.9595 4.3479 1.9604 1.6312 2.0622 3.6681 1.9956 1.3937 1.4061 2.4005 1.2685 1.2689 3.2865 2.3506 2.3566 1.6775 1.6711 2.1280 2.1791 2.0974 1.4063 2.3356 2.1387 2.1978 2.0509 1.8040 1.6508 1.6411 2.2124 3.0530 1.5529 1.4778 1.2709 1.2760 1.2345 1.9093 1.4779 1.0882 1.0977 1.0554 1.0535 1.0539 1.0529 1.0474 1.0592 1.0938 1.0726 10.0092 10.9587 7.4804 5.9410 7.5206 6.4214 1.0374 1.0392 1.0375 1.0388 1.0593 1.0633 1.0969 1.0961 1.0983 1.0969 1.0962 1.0982 1.0955 1.0909 1.0967 1.0969 1.0947 1.0926 1.0668 1.0627
irintensity: 0.7312 0.4179 0.3399 0.2787 0.2216 0.6448 2.8572 0.1584 0.6357 0.5126 0.6618 1.5117 3.5741 1.2327 0.9352 1.9414 2.8679 6.8718 1.2771 9.3880 2.1753 9.9324 22.6018 2.0480 9.0393 0.0382 24.9594 1.6168 6.2075 3.3567 1.9439 1.7239 2.7241 2.9523 18.4302 8.8239 61.9211 28.5357 57.2817 77.6642 3.1793 4.3423 1.7912 36.9514 7.4238 7.6809 21.1990 2.0169 2.0778 4.1976 81.5229 7.9058 23.5713 0.2923 55.0338 26.1003 3.3235 2.2235 28.2944 30.7512 24.0553 71.9745 12.1202 125.5875 48.2337 130.6925 61.5240 56.1631 4.4984 208.3157 49.1272 55.2831 9.6899 25.7184 29.2845 15.8632 13.6887 35.7646 20.6934 6.7369 0.4371 0.7064 19.0840 19.2459 26.6650 22.6361 8.9034 7.1660 48.1955 245.4225 161.6416 12.0434 15.8713 14.5276 36.8955 64.5499 26.4692 40.0114 14.3572 17.3057 4.9209 47.5328 8.2221 2.6889 27.0892 26.7300 3.3410 10.1413 31.2885 27.4851 11.3765 27.6955 743.5978 108.9950
temp: 298.150 k
press: 1.00000 atm
elementType: 8 8 8 8 6 6 6 6 6 6 6 6 6 6 6 6 6 6 6 6 1 1 1 1 1 1 1 1 1 1 1 1 1 1 1 1 1 1 1 1
symmnumber: 1
zpe: 844811.1 jmol-1
zpe.correction: 0.321772 hartree
zpe.thermalcorrener: 0.343780 hartree
zpe.thermalcorrenthalpy: 0.344724 hartree
zpe.thermalcorrgfe: 0.269085 hartree
zpe.sumelectzpe: -921.053416 hartree
zpe.sumelectthermal: -921.031408 hartree
zpe.sumelectthermalent: -921.030463 hartree
zpe.sumelectthermalfe: -921.106102 hartree
dipole: 4.2799 1.1164 1.7625
dipole: 4.7613
quadrupole: -90.8663 -131.3174 -119.7606
quadrupole: -4.7277 -1.8696 -7.9495
quadrupole: 23.1152 -17.3360 -5.7792 -4.7277 -1.8696 -7.9495
hfenergy: -921.3751873 hartree
pointgroup: C01 [X(C16H20O4)]
dipole: -1.7055972 0.6944995 -0.342937 debye
polarizability: 268.6896705|13.5845534|195.8683864|-0.4177347|26.9207575|144.8922265 unknown
InChI: InChI=1S/C16H20O4/c1-9(2)5-7-11-13(17)15(19)12(8-6-10(3)4)16(20)14(11)18/h5-6,17,20H,7-8H2,1-4H3
charge 0 multiplicity 1
40 atoms
O  -1.779063 -1.782233 -0.507425
O  1.982228 1.821252 1.510391
O  0.80957 -2.518337 -0.210584
O  -0.536266 2.558642 1.240741
C  -1.319031 0.444626 0.357715
C  1.527948 -0.399169 0.664646
C  -2.761114 0.931882 0.27664
C  2.967661 -0.86887 0.771317
C  -0.92212 -0.835491 -0.004561
C  1.119624 0.868295 1.005937
C  0.515488 -1.330797 0.130476
C  -0.301282 1.347353 0.873911
C  -3.505354 0.449299 -0.960736
C  3.660813 -0.848105 -0.58825
C  -4.736125 -0.152084 -1.022714
C  4.625195 0.020015 -1.008764
C  -5.361345 -0.494085 -2.365138
C  -5.584912 -0.507825 0.184891
C  5.232387 -0.117147 -2.397016
C  5.181666 1.165767 -0.180991
H  -3.297865 0.641522 1.200443
H  -2.730645 2.038745 0.284799
H  3.502377 -0.242243 1.502721
H  2.964393 -1.91052 1.143774
H  -3.006895 0.687126 -1.91327
H  3.320773 -1.631702 -1.280242
H  -5.597599 -1.573884 -2.432414
H  -4.701909 -0.230281 -3.209281
H  -6.3192 0.046765 -2.496117
H  -5.073057 -0.346987 1.146983
H  -6.509745 0.101939 0.190361
H  -5.90665 -1.565949 0.138532
H  5.051656 0.795103 -3.000416
H  4.816491 -0.980671 -2.944386
H  6.331954 -0.243725 -2.337752
H  4.620861 1.338617 0.750885
H  6.244817 0.983799 0.075639
H  5.155238 2.106941 -0.765018
H  -2.674396 -1.356072 -0.711732
H  1.424329 2.644285 1.678808
