program: Gaussian 09
title: 000023197
version: EM64L-G09RevD.01
frameworkgroup: C1[X(C10H20O2)]
method: RPBEPBE
basis: SDD
operation: Freq
keyword: #pfreq=noraman
keyword: PBEPBE/SDD
title: #p freq=noraman PBEPBE/SDD
converged: YES YES NO NO
title: Mulliken charges:
elementType: O O C C C C C C C C C C H H H H H H H H H H H H H H H H H H H H
charge: -0.312575 -0.431864 0.456027 -0.564684 -0.149619 -0.013833 -0.469326 -0.450768 -0.372948 -0.719338 -0.722067 -0.693368 0.232160 0.241836 0.209905 0.203271 0.222802 0.203964 0.203395 0.204090 0.211210 0.208342 0.240791 0.195068 0.221334 0.212110 0.250272 0.208250 0.336238 0.211456 0.212016 0.215853
chargesum: 0.00000
title: Mulliken charges with hydrogens summed into heavy atoms:
elementType: O O C C C C C C C C C C
charge: -0.312575 -0.095626 0.456027 -0.090688 0.060286 0.189438 -0.042560 -0.043283 0.046604 -0.062145 -0.051435 -0.054043
polarizability: 1.32726838e+02 -5.45310854e-01 1.08883866e+02 3.38088627e+00 -3.31311667e-01 9.82209306e+01
1716.lowfreq: -23.3250 -13.4157 -5.4868 -0.0005 -0.0001 0.0003 25.3212 59.2118 73.2037
frequency: 23.6083 59.1657 73.0891 90.0983 113.2400 160.0266 186.8835 208.6360 231.4158 232.5347 254.4861 288.9892 304.5849 312.1133 326.6935 335.2887 350.9850 439.7018 513.1614 518.0081 537.6183 634.5703 733.2685 744.9953 771.5635 810.0131 855.1518 861.6924 895.9803 903.2098 936.5067 972.6076 1002.1215 1025.1935 1029.3066 1037.0751 1062.6118 1067.3254 1070.6118 1092.6816 1127.9423 1134.7290 1163.1238 1189.7779 1219.0357 1235.5022 1252.2510 1261.3577 1269.4661 1280.7259 1289.6225 1304.5872 1310.2519 1342.8446 1349.9075 1371.7948 1378.1064 1384.8412 1386.7659 1387.3946 1456.0902 1458.0826 1459.9091 1469.9098 1474.3876 1475.9652 1476.9556 1481.8440 1486.8225 1492.0642 2934.1757 2962.4566 2968.9602 2972.5970 2976.4309 2979.1687 2979.4113 2985.9008 3012.0731 3014.0998 3026.3739 3044.1690 3070.1766 3072.0797 3072.7636 3074.2582 3083.7130 3094.2612 3094.3893 3561.4585
redmass: 3.3862 2.7050 2.8264 2.0856 2.2455 2.1273 1.0945 2.2041 1.1626 2.2804 1.5241 1.1219 2.8295 3.2589 2.3435 3.0624 2.5821 2.6458 2.6184 3.0272 5.7006 3.2163 2.0763 1.4256 1.4723 2.0606 1.9507 1.4362 1.7187 2.7100 1.9244 1.5861 2.0865 2.6998 1.7138 2.2798 2.3142 1.8455 2.2726 2.0333 2.1567 2.0039 1.8830 2.1411 1.6335 1.3934 1.3365 1.2124 1.3499 1.3150 1.2154 1.3729 1.3671 1.5820 1.5777 1.5444 1.4098 1.2260 1.2184 1.2949 1.0564 1.0691 1.0791 1.0873 1.0556 1.0432 1.0466 1.0524 1.0653 1.0669 1.0822 1.0865 1.0554 1.0399 1.0582 1.0609 1.0372 1.0389 1.0692 1.0901 1.0994 1.1009 1.1007 1.0995 1.0978 1.0993 1.1030 1.0998 1.0999 1.0662
irintensity: 0.9092 0.2734 0.5937 0.4320 0.2754 0.6579 0.1024 1.2566 0.3157 0.8864 0.3059 141.7762 1.4523 13.5558 1.2146 6.0951 7.9651 6.0583 8.0321 5.5821 0.5738 4.2739 5.5112 10.3003 3.1587 4.9880 6.1500 1.1422 10.5880 71.2790 13.2656 19.1211 26.5395 65.8283 34.0898 2.8523 3.6542 2.7329 46.8328 3.3654 7.9673 3.4653 2.7262 4.7404 15.2422 13.9771 5.2371 0.7862 26.4269 3.0108 13.2294 7.6417 10.6063 2.9032 7.0601 2.8602 10.4083 18.6836 8.1876 21.1641 6.2563 6.4581 10.5890 6.8095 2.1365 13.7519 11.1748 14.7148 18.1514 1.7057 20.7334 61.4716 10.4490 30.7877 44.2659 48.0233 32.1826 24.6194 9.3091 7.6909 30.8452 29.2859 76.8456 49.5740 42.2880 46.2239 26.8718 40.3601 21.3783 3.0218
temp: 298.150 k
press: 1.00000 atm
elementType: 8 8 6 6 6 6 6 6 6 6 6 6 1 1 1 1 1 1 1 1 1 1 1 1 1 1 1 1 1 1 1 1
symmnumber: 1
zpe: 744183.6 jmol-1
zpe.correction: 0.283445 hartree
zpe.thermalcorrener: 0.298149 hartree
zpe.thermalcorrenthalpy: 0.299093 hartree
zpe.thermalcorrgfe: 0.241735 hartree
zpe.sumelectzpe: -542.498825 hartree
zpe.sumelectthermal: -542.484121 hartree
zpe.sumelectthermalent: -542.483177 hartree
zpe.sumelectthermalfe: -542.540535 hartree
dipole: 0.8871 0.1867 -0.5843
dipole: 1.0785
quadrupole: -65.6649 -82.0118 -76.5229
quadrupole: 1.0780 0.9525 -3.5033
quadrupole: 9.0683 -7.2786 -1.7897 1.0780 0.9525 -3.5033
hfenergy: -542.7822696 hartree
pointgroup: C01 [X(C10H20O2)]
dipole: -0.3520697 0.0374193 0.2338774 debye
polarizability: 132.6395542|0.1849798|108.5709975|3.8164351|1.8582871|98.6210833 unknown
InChI: InChI=1S/C10H20O2/c1-4-6-10(5-2)7-9(11)8(3)12-10/h8-9,11H,4-7H2,1-3H3
charge 0 multiplicity 1
32 atoms
O  -0.667015 0.969411 -0.61225
O  -2.571765 -1.997233 0.478378
C  0.35739 0.278044 0.270304
C  -0.391282 -0.958012 0.859726
C  -1.879808 -0.70531 0.558902
C  -1.826058 0.068698 -0.782052
C  1.541642 -0.120274 -0.641824
C  0.728977 1.300281 1.37332
C  2.721304 -0.809729 0.08412
C  -3.05115 0.916503 -1.11948
C  1.291027 2.635457 0.842412
C  3.812268 -1.28316 -0.901034
H  -0.199674 -1.090242 1.937335
H  -0.101257 -1.890109 0.340677
H  -2.341539 -0.056457 1.334868
H  -1.625591 -0.669261 -1.591753
H  1.907786 0.783184 -1.165671
H  1.151475 -0.798191 -1.428033
H  1.455686 0.830398 2.06595
H  -0.186465 1.499985 1.96483
H  2.349955 -1.678953 0.664034
H  3.169071 -0.110893 0.818086
H  -2.891079 1.475168 -2.057524
H  -3.944961 0.277091 -1.254558
H  -3.250167 1.645844 -0.313695
H  2.276047 2.502852 0.358894
H  0.599784 3.070569 0.100361
H  1.419915 3.360272 1.666928
H  -3.544993 -1.838114 0.385654
H  3.40323 -2.015781 -1.622178
H  4.217125 -0.43322 -1.482075
H  4.655525 -1.763621 -0.371553
