program: Gaussian 09
title: 000256689
version: EM64L-G09RevD.01
frameworkgroup: C1[X(C14H11ClN4O2)]
method: RPBEPBE
basis: SDD
operation: Freq
keyword: #p
keyword: freq=noraman
keyword: PBEPBE/SDD
title: #p freq=noraman PBEPBE/SDD
converged: YES YES NO NO
title: Mulliken charges:
elementType: Cl O O N N N N C C C C C C C C C C C C C C H H H H H H H H H H H
charge: 0.026745 -0.286150 -0.249781 -0.147405 -0.030952 -0.019346 0.061053 -0.586911 0.521422 0.152663 0.137235 -0.195343 -0.420369 -0.349985 0.242433 -0.348872 -0.334065 -0.302268 -0.361058 0.179040 -0.499318 0.240366 0.267389 0.273886 0.236584 0.262406 0.274191 0.275763 0.256964 0.244409 0.234520 0.244753
chargesum: 0.00000
title: Mulliken charges with hydrogens summed into heavy atoms:
elementType: Cl O O N N N N C C C C C C C C C C C C C C
charge: 0.026745 -0.286150 -0.249781 -0.147405 -0.030952 -0.019346 0.061053 -0.079155 0.521422 0.152663 0.137235 0.078543 -0.183784 -0.087579 0.242433 -0.074681 -0.058302 -0.302268 -0.104094 0.179040 0.224364
polarizability: 2.62973189e+02 -1.77697335e+01 1.76650735e+02 5.34801608e+00 -2.13477939e+01 1.49835137e+02
1716.lowfreq: -4.1742 -0.0007 0.0016 0.0018 1.1614 2.4111 9.7810 22.4448 26.1041
frequency: 7.4596 22.4422 26.0717 57.9132 71.4741 94.4349 104.1311 120.3658 155.5502 174.3566 190.2793 216.8478 241.0871 284.2108 291.9203 300.1923 336.6513 373.3612 386.8004 406.4148 464.7322 482.7142 532.7338 543.1231 566.8732 612.5534 629.4338 631.7456 650.3638 653.3784 682.5535 716.0417 751.6952 778.3407 790.7454 804.9897 816.2291 844.9772 866.6861 876.4012 896.6659 916.5013 921.0370 948.9166 992.3691 1000.9374 1013.9657 1071.6632 1086.4868 1109.1447 1115.0441 1126.0350 1150.2027 1158.8240 1184.1308 1190.1542 1214.6162 1247.0507 1254.9438 1286.6419 1302.2984 1308.0692 1327.2671 1361.7186 1369.3928 1391.1122 1399.9431 1412.1616 1424.8973 1443.4398 1452.1147 1463.3893 1471.1570 1501.6058 1507.4623 1563.7214 1580.2581 1621.6421 1626.1769 3005.7732 3021.0373 3080.7748 3107.8997 3125.8870 3135.9807 3151.0957 3163.4280 3179.6542 3186.3642 3232.3845
redmass: 5.9834 8.4635 5.9372 4.5556 4.5048 1.8259 2.3234 5.5997 5.1109 4.9919 9.6791 7.2718 4.9354 6.0157 4.0653 7.3029 2.7064 7.5728 6.8850 2.8685 5.5885 4.2869 4.6035 5.6212 7.5241 6.2877 5.9615 6.9404 7.0400 5.1749 5.1825 3.8762 5.2186 5.0348 6.5079 8.9347 4.6405 1.5666 1.2678 1.7775 7.3367 1.4322 7.9016 1.9815 1.3830 1.3772 3.2546 4.4463 4.1355 3.4602 1.2639 1.6423 1.4841 3.1014 2.2005 1.1342 2.8016 1.9245 4.2300 8.3825 2.7845 1.7355 1.8545 2.0050 2.5021 5.4926 1.9711 2.7605 1.1883 2.6514 1.0495 1.0515 1.3294 2.6746 6.9350 10.0377 7.3532 6.6273 9.1229 1.0296 1.0594 1.1049 1.1045 1.0899 1.0911 1.1049 1.0950 1.0949 1.0930 1.0987
irintensity: 0.5820 0.4953 1.6249 1.1580 0.2565 0.9873 0.0598 0.1977 4.5277 2.9717 2.5895 1.4479 0.7255 6.6424 10.4280 0.2800 5.7445 9.5733 2.4235 0.1664 4.9383 7.5694 3.0177 8.3670 11.6170 1.2891 11.7063 0.5436 2.2559 13.2144 9.7841 75.9765 14.3147 5.9103 5.6805 18.2623 14.8401 14.2786 0.6095 26.8292 86.8662 12.3042 6.8408 17.0549 0.3339 0.1661 32.5288 180.8141 42.5401 8.7394 0.0270 5.2455 58.8868 86.7123 21.4282 34.3984 16.3032 39.8338 282.1925 55.2247 33.1971 53.2940 49.7149 12.6430 5.2071 5.0403 56.9237 19.1750 32.6998 70.2809 14.7085 10.9555 61.2330 29.0315 104.6441 108.1620 16.4591 19.0280 201.5652 38.1581 21.8826 4.4532 24.8370 11.6277 2.9877 14.0859 3.8302 0.4921 8.5663 0.1775
temp: 298.150 k
press: 1.00000 atm
elementType: 17 8 8 7 7 7 7 6 6 6 6 6 6 6 6 6 6 6 6 6 6 1 1 1 1 1 1 1 1 1 1 1
symmnumber: 1
zpe: 606277.7 jmol-1
zpe.correction: 0.230919 hartree
zpe.thermalcorrener: 0.248994 hartree
zpe.thermalcorrenthalpy: 0.249938 hartree
zpe.thermalcorrgfe: 0.180318 hartree
zpe.sumelectzpe: -1368.127907 hartree
zpe.sumelectthermal: -1368.109832 hartree
zpe.sumelectthermalent: -1368.108888 hartree
zpe.sumelectthermalfe: -1368.178508 hartree
dipole: -3.9619 1.5734 2.2931
dipole: 4.8405
quadrupole: -150.4831 -113.2060 -132.3569
quadrupole: 17.8518 4.0300 0.5540
quadrupole: -18.4677 18.8093 -0.3416 17.8518 4.0300 0.5540
hfenergy: -1368.3588259 hartree
pointgroup: C01 [X(C14H11Cl1N4O2)]
dipole: -1.5109625 0.4584174 1.0647155 debye
polarizability: 261.2554208|-22.0380227|186.4425128|-2.8936215|-12.4823261|141.7611277 unknown
InChI: InChI=1S/C14H11ClN4O2/c1-21-14(20)10-4-2-9(3-5-10)6-19-8-18-11-12(15)16-7-17-13(11)19/h2-5,7-8H,6H2,1H3
charge 0 multiplicity 1
32 atoms
Cl 5.533943 -1.147214 -1.967136
O  -4.869815 -1.550955 -0.397793
O  -5.578125 0.628887 -0.817687
N  1.709386 1.138091 0.422111
N  3.099758 1.123446 -1.416124
N  2.573754 -0.86064 1.597777
N  4.425221 -1.908777 0.392201
C  0.623995 1.533686 1.350745
C  -0.755505 1.081621 0.884309
C  2.552255 0.039312 0.581679
C  3.416467 0.048113 -0.570396
C  2.079982 1.739673 -0.79097
C  -1.723933 2.029634 0.471906
C  -1.083236 -0.299135 0.868289
C  -3.320233 0.228557 0.024787
C  -2.999127 1.608793 0.044027
C  -2.354932 -0.725607 0.440514
C  4.364588 -0.998664 -0.594173
C  3.540176 -1.809074 1.43938
C  -4.684262 -0.166489 -0.436044
C  -6.200459 -2.026842 -0.843555
H  0.657423 2.630612 1.470021
H  0.875921 1.072591 2.322335
H  1.572503 2.624941 -1.169712
H  -1.48261 3.099481 0.48857
H  -0.339706 -1.034077 1.198407
H  -3.758895 2.328465 -0.277491
H  -2.614906 -1.787356 0.427492
H  3.62418 -2.571062 2.217723
H  -6.992614 -1.591957 -0.211281
H  -6.158832 -3.119383 -0.73434
H  -6.376464 -1.73737 -1.893169
