program: Gaussian 09
title: 000256682
version: EM64L-G09RevD.01
frameworkgroup: C1[X(C10H10N4O2)]
method: RPBEPBE
basis: SDD
operation: Freq
keyword: #p
keyword: freq=noraman
keyword: PBEPBE/SDD
title: #p freq=noraman PBEPBE/SDD
converged: YES YES NO NO
title: Mulliken charges:
elementType: O O N N N N C C C C C C C C C C H H H H H H H H H H
charge: -0.268885 -0.257751 -0.402507 -0.444449 -0.382726 -0.349266 0.299453 0.461617 0.116695 -0.244159 -0.427331 -0.369051 0.151521 -0.191137 -0.203660 -0.268379 0.335327 0.302203 0.281995 0.363918 0.347436 0.218689 0.253581 0.223589 0.224448 0.228830
chargesum: 0.00000
title: Mulliken charges with hydrogens summed into heavy atoms:
elementType: O O N N N N C C C C C C C C C C
charge: -0.268885 -0.257751 -0.067179 -0.142247 -0.018809 -0.001830 0.299453 0.461617 0.116695 0.037836 -0.208641 -0.115470 0.151521 0.032452 0.020788 -0.039549
polarizability: 1.98309533e+02 5.78278791e-01 1.21094804e+02 9.03299875e+00 2.88820184e+00 1.13519408e+02
1716.lowfreq: -4.3748 0.0004 0.0006 0.0007 3.2932 5.7509 19.2088 26.9813 47.0419
frequency: 19.1656 26.9597 47.0323 101.3970 152.3034 176.1777 223.4971 226.9847 271.7671 344.6420 366.7256 371.9639 396.6745 407.2534 468.6503 495.0682 516.5266 522.2976 560.1016 598.2895 611.9719 618.7292 665.8997 688.7525 695.3213 731.3337 749.7552 757.7901 773.9577 808.1328 815.2151 825.5349 834.5773 887.4667 946.1194 961.3766 979.8723 982.2940 1021.0844 1080.1442 1115.3158 1164.7177 1170.8005 1181.3414 1208.4556 1250.5322 1302.3019 1316.3598 1348.4683 1359.3621 1381.6974 1386.9889 1419.6745 1429.0306 1479.6796 1486.4389 1515.8243 1598.7874 1610.1391 1618.3062 1667.2983 1686.3464 3111.7466 3130.0119 3140.8539 3157.4006 3169.9252 3199.0649 3471.8641 3513.0801 3530.5268 3573.9464
redmass: 6.7974 6.2325 3.9897 8.0744 5.6949 7.4713 5.7121 5.7529 7.0732 6.8029 2.0013 1.9845 3.9027 2.9095 6.6424 3.0815 5.4230 7.4376 1.2965 4.1818 5.2834 1.2934 5.0109 2.2920 1.9232 3.6275 7.9408 1.7116 2.3175 5.2852 4.8390 1.2789 1.3461 1.4577 3.0429 1.3605 5.8071 1.3045 2.1806 1.7018 2.8522 2.1753 1.0771 1.1438 3.7840 3.2846 1.6517 1.5989 2.1104 2.2536 4.1273 2.9057 1.6954 2.1795 1.7379 2.6169 1.9337 5.2660 6.6682 6.2015 5.5270 6.5869 1.0876 1.0861 1.0927 1.0940 1.1007 1.0937 1.0774 1.0773 1.0771 1.0783
irintensity: 0.0144 0.5054 0.4434 2.0108 8.2196 2.0189 7.9320 5.5334 0.5228 9.6430 95.0668 77.7733 0.1956 0.0582 10.6184 8.2669 9.1826 3.2505 115.1556 10.2918 6.5332 105.6376 9.6775 0.4711 40.9374 34.0752 9.8042 70.4671 128.2835 2.2456 19.6623 6.0196 41.1926 5.5456 8.9212 0.0723 1.4943 0.5571 9.1316 6.6095 12.8409 51.4492 3.2462 9.5431 16.2597 139.2714 2.2068 9.9385 7.8306 61.2488 29.2446 56.8392 15.8617 2.4518 30.7320 114.9484 52.0030 3.8759 345.1298 181.5493 449.3448 374.7507 13.6642 0.8062 25.8237 30.0429 12.6932 6.2014 47.3243 32.4043 63.9555 81.7200
temp: 298.150 k
press: 1.00000 atm
elementType: 8 8 7 7 7 7 6 6 6 6 6 6 6 6 6 6 1 1 1 1 1 1 1 1 1 1
symmnumber: 1
zpe: 516936.9 jmol-1
zpe.correction: 0.196891 hartree
zpe.thermalcorrener: 0.210543 hartree
zpe.thermalcorrenthalpy: 0.211487 hartree
zpe.thermalcorrgfe: 0.154415 hartree
zpe.sumelectzpe: -755.384796 hartree
zpe.sumelectthermal: -755.371144 hartree
zpe.sumelectthermalent: -755.370200 hartree
zpe.sumelectthermalfe: -755.427272 hartree
dipole: -3.4611 -1.1254 -2.7195
dipole: 4.5433
quadrupole: -107.5374 -97.9671 -84.3178
quadrupole: 4.1839 0.1626 -0.6973
quadrupole: -10.9299 -1.3597 12.2896 4.1839 0.1626 -0.6973
hfenergy: -755.5816867 hartree
pointgroup: C01 [X(C10H10N4O2)]
dipole: 1.3119995 -1.0273114 0.6467879 debye
dipolederiv: -0.5726674 0.0254874 -0.0331748 -0.0319696 -1.2004073 -0.2976003 -0.0868377 -0.2281495 -0.4600432 -1.4094087 -0.266384 -0.4433877 -0.2766775 -0.5455288 -0.1482986 -0.548214 -0.1695475 -0.6377326 -0.6731095 -0.3379591 -0.2059201 -0.356246 -0.0733139 -0.0079984 -0.1467174 -0.1991909 -0.65348 -0.7778527 -0.1203081 0.3937549 -0.5975017 -0.2758947 -0.1418385 0.5729492 -0.1318709 -0.2163002 -0.6652064 -0.3092849 -0.1908972 -0.3541564 -0.6919825 -0.27076 -0.2433245 -0.2471271 -0.4920256 -1.0573378 -0.4676445 -0.3792096 0.4813249 -0.4114056 0.155378 -0.1984273 -0.2487757 -0.4122377 0.7562112 0.6518553 0.3927625 0.8207251 -0.4419528 0.0613083 0.5548304 0.189071 0.2695229 1.0775859 0.0347817 -0.537678 0.1497163 0.0614246 0.0623242 -0.9647709 0.0379939 0.3882565 0.8297293 -0.1376055 0.1792087 0.0956321 1.5017929 0.450479 0.2673352 0.287839 0.4468923 0.3211633 0.4977216 0.305632 -0.3484009 0.2787298 0.0306952 0.1169542 0.3672368 0.0069815 -0.4434738 -0.0970753 0.2114945 0.0868951 -0.1447144 -0.1954607 0.0226716 -0.0719953 -0.0228434 -0.171052 -0.0201106 0.0068996 -0.2321858 -0.1526461 0.0089154 0.4065859 -0.0880185 -0.2302474 1.8881439 0.3036786 0.6897505 -0.0444636 0.9247931 0.1833928 0.7053558 0.3238947 0.6642253 0.1282643 -0.053624 -0.0997235 -0.0989474 -0.0334418 -0.085863 -0.0278827 -0.1384754 0.1322843 0.2001065 -0.1272609 0.0080786 -0.0757073 -0.0262348 -0.116914 -0.1331728 -0.0800987 0.1031882 -0.1774623 0.0070307 -0.1093819 0.0252824 -0.2305635 0.0171117 -0.0734634 0.0220613 -0.1588841 0.1306027 0.0328098 -0.0317048 0.0804753 0.1808903 -0.0096294 -0.0935405 0.0653078 0.3446685 0.0540216 0.0733887 -0.0504343 0.2465382 0.2435071 0.0495093 -0.0154848 0.0644419 0.1318675 0.0799859 0.0566503 -0.0571304 0.1205234 0.0630545 -0.0201129 -0.0374818 -0.0180106 0.1519321 0.2331549 -0.0213928 -0.056116 -0.0361183 0.1932492 -0.0497345 -0.0609353 -0.0461973 0.2969924 0.1802534 0.0048284 -0.0712898 0.0446021 0.2752214 -0.0123869 -0.0641259 -0.0198811 0.3061645 0.1016785 0.0125541 0.0433022 0.0241408 0.100307 0.105257 0.0140611 0.1135126 -0.0861524 -0.0035684 0.0977368 -0.032262 0.1119185 0.0959339 0.0426023 -0.0692442 0.0249537 0.0866829 -0.0731721 0.10513 -0.0415101 0.1156447 0.0795307 0.0527363 -0.0430575 0.0544495 0.0836223 0.0922775 0.0250374 -0.0048559 0.0162839 0.0825931 0.1090004 0.022735 0.1085448 -0.065754 -0.0488679 0.0299588 0.1137928 0.0326716 0.1470586 0.0278874 0.123202 0.0280315 0.0224192 unknown
polarizability: 197.311918|-7.9399805|121.5398562|10.1206475|2.2951074|114.0719711 unknown
InChI: InChI=1S/C10H10N4O2/c15-9-8(6-11-10(16)12-9)14-13-7-4-2-1-3-5-7/h1-6,11-14H
charge 0 multiplicity 1
26 atoms
O  -2.128791 2.386191 0.734453
O  -4.609056 -1.006646 -1.373617
N  -0.027678 0.682161 1.275279
N  1.097149 -0.098604 1.496463
N  -3.3463 0.667488 -0.30113
N  -2.469383 -1.491992 -0.533605
C  -1.138492 0.18403 0.585935
C  2.206056 -0.103045 0.613723
C  -2.210507 1.173128 0.365266
C  -1.292565 -1.106656 0.126816
C  3.385234 -0.801495 0.995027
C  2.156728 0.556828 -0.642973
C  -3.554725 -0.645418 -0.781798
C  4.494757 -0.837772 0.126326
C  3.277032 0.510363 -1.50063
C  4.451313 -0.183994 -1.128478
H  -0.013798 1.691121 1.462254
H  1.21929 -0.466414 2.442453
H  -0.516542 -1.863192 0.249826
H  -4.113975 1.325498 -0.468534
H  -2.577417 -2.447684 -0.875505
H  3.429626 -1.310374 1.966688
H  1.252669 1.098127 -0.938477
H  5.398414 -1.377028 0.432686
H  3.229631 1.023573 -2.467943
H  5.31593 -0.212995 -1.799303
