program: Gaussian 09
title: 000263445
version: EM64L-G09RevD.01
frameworkgroup: C1[X(C10H12O5S)]
method: RPBEPBE
basis: SDD
operation: Freq
keyword: #p
keyword: freq=noraman
keyword: PBEPBE/SDD
title: #p freq=noraman PBEPBE/SDD
converged: YES YES NO NO
title: Mulliken charges:
elementType: S O O O O O C C C C C C C C C C H H H H H H H H H H H H
charge: 1.038181 -0.297311 -0.257097 -0.391643 -0.511859 -0.500871 -0.015985 -0.349495 -0.384409 0.236249 0.245824 -0.368110 -0.373248 -0.226392 -0.223983 -0.719592 0.254166 0.221735 0.271938 0.264582 0.257377 0.246993 0.250419 0.228429 0.228827 0.291345 0.296355 0.287574
chargesum: 0.00000
title: Mulliken charges with hydrogens summed into heavy atoms:
elementType: S O O O O O C C C C C C C C C C
charge: 1.038181 -0.297311 -0.257097 -0.391643 -0.511859 -0.500871 0.238181 0.144178 0.137550 0.236249 0.245824 -0.121117 -0.122829 0.002037 0.004843 0.155683
polarizability: 2.16662601e+02 4.57561395e+00 1.40474935e+02 -3.75309516e+00 -3.80144715e+00 9.28780791e+01
1716.lowfreq: -3.9512 -0.0017 0.0006 0.0016 7.1975 11.9787 24.2507 27.5174 61.7321
frequency: 23.7558 27.2967 61.7031 70.8773 125.6482 146.1148 156.4037 166.5687 183.0151 221.2970 250.1322 279.9518 291.0161 305.2900 345.9929 372.2015 403.1848 414.2314 449.1611 470.3166 486.2473 517.7014 549.8550 578.1524 604.9320 641.3454 711.6003 721.7546 753.9521 813.3793 835.2708 845.3416 849.3441 899.1146 912.6496 932.2030 936.7707 965.7755 978.4159 998.8895 1024.6483 1038.7540 1042.6412 1085.6729 1095.0128 1130.8381 1161.2174 1164.9643 1207.9333 1229.5416 1242.6119 1271.8909 1295.4069 1320.2316 1329.1851 1352.9933 1373.7811 1395.5172 1415.2700 1417.1584 1443.9481 1450.0822 1464.3701 1475.2037 1592.7776 1612.2771 2984.2768 2988.2795 3012.1767 3040.7715 3068.2946 3099.7714 3136.9466 3150.6354 3163.3044 3175.1213 3189.5599 3198.6084
redmass: 5.4406 6.5740 6.5766 6.3285 6.7310 3.1693 1.3227 2.2352 4.5557 5.1005 3.2843 7.7993 5.0534 7.1998 9.1210 4.8748 3.2700 3.6222 3.1760 7.2267 5.8625 7.2144 4.1532 6.5368 8.7151 3.7479 4.3284 5.9926 1.2367 5.2298 10.8392 1.9751 1.7341 2.4053 2.9999 1.3789 6.2824 1.2930 6.6966 1.3916 2.0467 1.9358 2.3695 2.5680 2.4610 2.1121 1.0791 2.4098 1.1337 1.8362 1.6885 1.4001 1.2187 1.1309 1.2966 1.2767 1.9368 3.3005 1.0512 1.0502 2.4009 1.0785 1.2246 2.3550 7.5604 7.1001 1.0634 1.0662 1.0813 1.0247 1.1016 1.1014 1.0852 1.0899 1.0947 1.1006 1.1079 1.1079
irintensity: 3.4831 1.6473 1.3478 1.8275 2.6316 6.5001 1.3088 2.5565 6.4734 2.3239 7.7501 11.1411 0.6752 31.2682 13.5494 15.9661 8.5131 6.4746 6.6791 79.6496 3.2719 8.4686 2.4355 3.8851 61.4487 7.2140 0.3303 7.2503 108.0269 17.3634 56.2345 5.4053 3.9009 7.0688 33.4884 7.9342 165.8492 0.0060 27.6303 21.7525 14.4950 55.7540 29.4736 29.1195 4.6339 4.9517 7.0157 6.2992 1.1347 133.8261 159.1037 3.6202 2.2161 2.2641 20.1942 3.5421 20.6591 13.8446 13.8219 14.1574 5.4155 20.6394 19.4652 184.5246 28.9363 3.1785 5.3647 22.2464 31.9396 0.6510 6.6994 3.3907 1.4465 13.2986 14.4532 15.0735 0.1629 0.1018
temp: 298.150 k
press: 1.00000 atm
elementType: 16 8 8 8 8 8 6 6 6 6 6 6 6 6 6 6 1 1 1 1 1 1 1 1 1 1 1 1
symmnumber: 1
zpe: 545129.5 jmol-1
zpe.correction: 0.207629 hartree
zpe.thermalcorrener: 0.223503 hartree
zpe.thermalcorrenthalpy: 0.224447 hartree
zpe.thermalcorrgfe: 0.162903 hartree
zpe.sumelectzpe: -1161.035812 hartree
zpe.sumelectthermal: -1161.019938 hartree
zpe.sumelectthermalent: -1161.018994 hartree
zpe.sumelectthermalfe: -1161.080538 hartree
dipole: 3.4986 -2.4763 -1.7467
dipole: 4.6285
quadrupole: -71.8817 -104.6845 -107.9018
quadrupole: -5.6870 -9.5519 1.2467
quadrupole: 22.9409 -9.8619 -13.0791 -5.6870 -9.5519 1.2467
hfenergy: -1161.243441 hartree
pointgroup: C01 [X(C10H12O5S1)]
dipole: 1.4565355 -1.0858527 -0.1245149 debye
polarizability: 213.3889219|5.4061025|119.504903|-16.3580081|-25.2367316|117.12179 unknown
InChI: InChI=1S/C10H12O5S/c1-16(11,12)14-7-8-6-13-9-4-2-3-5-10(9)15-8/h2-5,8H,6-7H2,1H3
charge 0 multiplicity 1
28 atoms
S  3.647295 0.630858 -0.549694
O  -0.789741 -1.062227 0.84329
O  -1.331164 1.096072 -1.047311
O  2.657368 -0.980375 -0.485754
O  3.755843 1.198796 0.96467
O  3.091721 1.587498 -1.731135
C  0.214256 -0.607388 -0.154765
C  0.005052 0.885304 -0.449779
C  1.558942 -0.960215 0.496728
C  -2.104029 -0.595639 0.591664
C  -2.367274 0.446046 -0.339162
C  -3.164153 -1.204104 1.292708
C  -3.695179 0.851869 -0.582343
C  -4.492081 -0.787313 1.056194
C  -4.758004 0.233833 0.111028
C  5.249033 -0.215131 -1.09991
H  0.078865 -1.191764 -1.086382
H  0.086865 1.473814 0.486252
H  0.723586 1.262896 -1.194676
H  1.511353 -1.993684 0.88397
H  1.798536 -0.281777 1.341034
H  -2.931608 -2.000773 2.00653
H  -3.87069 1.653279 -1.306843
H  -5.313743 -1.26211 1.602191
H  -5.787462 0.553676 -0.080402
H  5.534634 -0.883583 -0.27821
H  4.995795 -0.76117 -2.018028
H  5.975383 0.591009 -1.271864
