program: Gaussian 09
title: 000263421
version: EM64L-G09RevD.01
frameworkgroup: C1[X(C6H7BrN2OS)]
method: RPBEPBE
basis: SDD
operation: Freq
keyword: #p
keyword: freq=noraman
keyword: PBEPBE/SDD
title: #p freq=noraman PBEPBE/SDD
converged: NO NO NO NO
title: Mulliken charges:
elementType: Br S O N N C C C C C C H H H H H H H
charge: 0.068166 0.236635 -0.223142 -0.351029 0.018475 -0.559651 -0.177628 -0.660061 0.242739 -0.256089 -0.223853 0.286822 0.286569 0.350400 0.232727 0.232767 0.233169 0.262984
chargesum: 0.00000
title: Mulliken charges with hydrogens summed into heavy atoms:
elementType: Br S O N N C C C C C C
charge: 0.068166 0.236635 -0.223142 -0.000629 0.018475 0.013741 -0.177628 0.038602 0.242739 -0.256089 0.039131
polarizability: 2.11519775e+02 6.07468490e+00 1.08386387e+02 4.51231112e-02 7.14961320e-03 5.08115608e+01
1716.lowfreq: -4.3377 0.0008 0.0008 0.0017 4.5834 7.4505 36.5578 53.3155 74.3342
frequency: 36.3801 53.2699 74.3255 92.9155 153.9413 177.9845 222.9043 237.7273 263.2381 288.8651 317.2467 387.4849 475.7522 529.0225 536.1010 623.9945 636.2488 682.5579 712.9658 764.6963 777.4799 898.6659 916.8659 967.4803 992.2393 1050.4571 1068.3041 1118.1807 1123.6221 1233.5270 1246.0685 1281.6661 1329.1983 1400.8499 1411.4487 1448.8760 1472.2600 1482.5790 1490.1330 1514.9684 1647.8766 2990.8401 3055.3850 3087.0399 3089.5855 3136.7188 3164.4597 3480.2128
redmass: 2.8724 2.6816 9.5983 4.5519 6.8589 10.5155 7.7445 1.0936 9.0070 11.5598 4.7543 2.9449 10.5620 7.6851 10.2195 4.8679 8.2178 8.0670 2.0587 2.3980 1.1269 6.9689 1.4172 10.2138 1.8628 1.2187 2.1919 6.6055 2.9974 1.2220 3.5380 1.2494 1.5941 1.2031 2.5784 1.0843 1.0387 1.0642 4.1651 5.6986 7.6299 1.0356 1.0597 1.0972 1.1015 1.1086 1.0933 1.0778
irintensity: 0.0000 1.2536 0.1332 0.6370 10.4288 0.9305 0.0360 0.1169 1.1162 0.0181 2.3065 15.2942 20.0595 6.5848 24.2024 10.5743 5.5576 0.2239 10.9615 78.4075 25.0839 4.3210 9.9530 84.3554 37.2743 0.1835 2.8350 22.7522 133.5091 0.6266 72.8493 26.7973 7.6540 19.6990 5.4210 18.7917 16.8422 18.1924 379.8592 93.6364 464.5884 27.1635 2.8979 19.2688 15.1752 16.3506 11.7361 40.2838
temp: 298.150 k
press: 1.00000 atm
elementType: 35 16 8 7 7 6 6 6 6 6 6 1 1 1 1 1 1 1
symmnumber: 1
zpe: 329838.0 jmol-1
zpe.correction: 0.125629 hartree
zpe.thermalcorrener: 0.137290 hartree
zpe.thermalcorrenthalpy: 0.138234 hartree
zpe.thermalcorrgfe: 0.085426 hartree
zpe.sumelectzpe: -828.266611 hartree
zpe.sumelectthermal: -828.254950 hartree
zpe.sumelectthermalent: -828.254006 hartree
zpe.sumelectthermalfe: -828.306814 hartree
dipole: -5.1809 -2.1903 0.0051
dipole: 5.6249
quadrupole: -74.1296 -82.5326 -82.2550
quadrupole: -4.4399 -0.0519 -0.0189
quadrupole: 5.5094 -2.8935 -2.6160 -4.4399 -0.0519 -0.0189
hfenergy: -828.3922398 hartree
pointgroup: C01 [X(C6H7Br1N2O1S1)]
dipole: 2.1413581 -0.5386917 -0.1475536 debye
dipolederiv: -0.6624887 -0.2115894 0.0129837 -0.2932589 -0.0931015 0.0035242 0.0059242 -0.000215 0.0212951 -0.9587138 -0.0089116 0.040002 -0.1728971 -0.1322487 0.0037817 0.0241775 -0.0039744 -0.0837317 -0.8428909 0.3996919 0.0562877 0.5701721 -0.8646822 -0.069322 0.0706028 -0.0615703 -0.3619358 -1.1448448 0.411617 0.0766917 -0.1899639 -0.3961089 -0.0052202 0.0248493 -0.0323155 -0.2373087 -1.2298454 -0.0986755 0.0388992 -1.0782575 -0.7847212 -0.0022946 -0.0466733 -0.0473775 -0.187668 0.4567113 -0.2147365 -0.0350383 -0.4409624 0.1957811 0.0266149 -0.0539638 0.0162932 0.1376556 1.517781 0.0130241 -0.0645185 1.1247853 0.8272843 0.0132304 0.0321205 0.0645033 0.0679832 -0.1346095 -0.0052938 0.0092595 0.2099602 0.0182892 -0.0145974 0.0292158 -0.00448 0.067883 1.1348423 -0.6677702 -0.095986 -0.6305625 1.0824356 0.0978 -0.0922678 0.0995468 0.2812253 0.7654429 0.452083 -0.0039316 0.8695381 -0.4020924 -0.0592573 0.0319837 -0.0404248 -0.1735091 0.7455419 -0.0857648 -0.0404404 0.0775475 0.3897558 0.0294083 -0.0262811 0.0367583 0.0104532 0.0069304 -0.0005357 0.0440806 0.0664235 -0.0281827 0.0659093 0.0656749 0.0549099 -0.0053969 -0.0038531 0.0020919 -0.0453471 0.0710167 -0.005476 -0.0734309 -0.0546321 -0.0560753 -0.0187472 0.1668241 -0.0254426 0.0049703 -0.0229075 0.1960598 -0.0104015 0.005417 -0.0104292 0.3301081 0.0962628 -0.0087009 0.0110455 -0.0978065 0.0230307 0.1198835 0.0477749 0.1046389 -0.0405498 0.0881264 -0.0145441 -0.0275409 -0.0963783 0.0602333 -0.0925383 -0.080022 -0.0854434 -0.069826 -0.0688285 0.094877 0.0180504 0.1154866 -0.0471004 -0.021605 0.0199276 -0.0206222 0.1246645 0.0676116 -0.0314198 0.0005325 -0.0819353 -0.0391557 -0.0114852 -0.0038281 -0.0137227 0.1374052 unknown
polarizability: 210.6951974|9.9283669|108.5203703|-6.4723838|4.5447363|51.5021552 unknown
InChI: InChI=1S/C6H7BrN2OS/c1-2-11-6-8-3-4(7)5(10)9-6/h3,9H,2H2,1H3
charge 0 multiplicity 1
18 atoms
Br -3.819637 -1.262944 0.032716
S  2.280834 1.025266 -0.045661
O  -2.707308 1.771429 0.240771
N  -0.433003 1.232201 0.093028
N  0.400193 -0.98642 -0.13442
C  3.301871 -0.56808 -0.238966
C  0.604629 0.325887 -0.030938
C  4.789842 -0.193676 -0.276222
C  -1.831498 0.874502 0.125067
C  -2.007958 -0.577817 0.008969
C  -0.918231 -1.427241 -0.113016
H  3.045434 -1.215303 0.613003
H  2.960222 -1.053414 -1.165414
H  -0.250033 2.240405 0.170755
H  5.024429 0.469171 -1.127598
H  5.110403 0.30523 0.655208
H  5.387876 -1.116008 -0.389873
H  -1.057366 -2.50879 -0.199309
