program: Gaussian 09
title: 000256676
version: EM64L-G09RevD.01
frameworkgroup: C1[X(C18H16N2O2)]
method: RPBEPBE
basis: SDD
operation: Freq
keyword: #p
keyword: freq=noraman
keyword: PBEPBE/SDD
title: #p freq=noraman PBEPBE/SDD
converged: YES YES NO NO
title: Mulliken charges:
elementType: O O N N C C C C C C C C C C C C C C C C C C H H H H H H H H H H H H H H H H
charge: -0.276505 -0.223723 -0.143709 -0.103584 0.402015 0.517369 -0.371516 -0.373231 -0.434751 -0.395086 -0.365450 0.039905 0.086919 0.301689 -0.644098 -0.645352 0.122157 -0.374049 -0.343810 -0.222986 -0.226973 -0.234165 0.241194 0.243555 0.228567 0.307669 0.245949 0.241347 0.241520 0.222473 0.244385 0.221016 0.244320 0.268516 0.269949 0.229015 0.229465 0.229995
chargesum: 0.00000
title: Mulliken charges with hydrogens summed into heavy atoms:
elementType: O O N N C C C C C C C C C C C C C C C C C C
charge: -0.276505 -0.223723 -0.143709 -0.103584 0.402015 0.517369 -0.130322 -0.129675 -0.206184 -0.087417 -0.119500 0.039905 0.086919 0.301689 0.061242 0.064369 0.122157 -0.105533 -0.073862 0.006029 0.002492 -0.004170
polarizability: 6.65163420e+02 1.34908846e+01 2.06485847e+02 1.74783131e-02 5.52779181e-02 9.19931159e+01
1716.lowfreq: -5.6295 -3.8530 -2.9310 -0.0009 -0.0005 0.0007 21.3974 35.6839 53.9233
frequency: 21.3862 35.6277 53.9122 54.2327 72.4213 86.8765 113.5309 115.2980 128.4274 186.9266 191.6978 197.5462 202.1730 210.5736 282.0201 285.4251 320.5429 377.5669 388.0322 402.6772 404.2163 433.3033 443.3604 472.5826 493.3498 526.9351 537.8594 572.2743 613.5108 629.1774 653.0137 669.0734 698.3521 703.8212 723.4212 740.5476 752.0114 753.2112 782.4387 808.0869 813.3620 843.1887 847.3225 860.2070 937.3569 937.5592 942.9012 946.2388 972.1446 987.7045 991.0680 994.0708 1003.4670 1013.3170 1018.4187 1043.9187 1052.6509 1083.4854 1101.2694 1111.2118 1115.9492 1156.2720 1165.0671 1172.8059 1185.1519 1219.7606 1252.9248 1259.3511 1286.0647 1319.3326 1343.1592 1356.9741 1374.7912 1386.3722 1393.0078 1429.3415 1437.5159 1455.5568 1462.1297 1464.6143 1469.5113 1477.9118 1489.8422 1502.9921 1523.7198 1535.3425 1538.2463 1583.7073 1606.4514 1621.5912 1638.7544 1677.6667 2953.2364 2960.8565 3023.6820 3029.3130 3100.4552 3103.0796 3114.1296 3122.5693 3128.4635 3140.2736 3146.4985 3154.2811 3164.7948 3166.6039 3170.0495 3173.1515
redmass: 5.3566 3.1755 5.2029 3.9750 4.2321 2.9604 5.3065 3.6562 1.4825 1.3633 5.2502 2.9236 6.4511 4.9615 4.1946 3.5381 6.9865 5.0082 6.1437 3.1210 2.9492 4.5257 3.3233 3.7084 4.0090 5.0041 2.3161 5.9049 6.4830 7.4269 8.2036 6.1627 1.7743 6.2836 7.7033 8.5693 3.7310 8.0250 1.9094 1.3511 11.2011 1.5549 6.3007 1.2466 3.7382 1.3516 1.4245 5.5415 1.4744 6.2297 1.3812 2.9559 1.3242 1.3155 3.1927 2.8613 1.5245 1.7411 1.2371 1.3329 3.3876 1.7632 1.6862 1.0574 1.1163 1.2243 2.7842 2.1490 3.0791 1.3603 1.6375 2.2552 3.1278 8.4460 2.3806 1.1705 2.3430 1.2496 2.9412 1.0403 2.4869 1.0455 1.1630 1.1375 4.0368 3.3972 5.8932 6.2016 6.5246 6.5285 7.5004 10.3835 1.0365 1.0385 1.1005 1.1022 1.0869 1.0974 1.0952 1.0891 1.0852 1.0890 1.0912 1.0935 1.0963 1.0933 1.0945 1.1000
irintensity: 2.3800 0.0076 1.8966 0.0853 0.2982 0.1209 0.0555 2.9939 1.1509 0.8179 0.0986 2.8558 2.1167 0.0282 0.8816 1.0861 4.2384 1.9003 4.8913 1.0065 0.1425 3.9207 0.0006 2.8596 2.6985 5.9017 18.9097 14.2271 0.5136 0.1007 4.1356 30.0438 56.7168 2.2498 7.1526 2.4857 4.5536 85.7546 44.4444 16.8792 232.1257 55.7685 0.2659 0.0161 1.5244 11.2725 5.8623 116.3330 12.1518 0.1850 0.0104 0.4778 0.5505 2.8723 8.0784 42.2266 24.4818 5.2092 0.0114 0.9496 15.4509 7.9220 11.7102 0.0962 12.0489 242.2287 26.8838 13.7190 45.8113 5.7300 12.2886 38.6798 322.6055 1.8643 53.9520 10.4114 15.3002 57.3461 6.2921 0.0251 25.0697 24.7430 6.0445 62.5027 412.6147 95.6574 13.2580 57.2150 449.7053 770.0958 10.1520 223.9050 97.7543 188.7961 19.8095 49.3477 4.7652 4.0274 47.6872 7.9409 1.3496 13.2138 6.4787 29.9218 17.1401 13.4846 36.0066 26.2501
temp: 298.150 k
press: 1.00000 atm
elementType: 8 8 7 7 6 6 6 6 6 6 6 6 6 6 6 6 6 6 6 6 6 6 1 1 1 1 1 1 1 1 1 1 1 1 1 1 1 1
symmnumber: 1
zpe: 778718.8 jmol-1
zpe.correction: 0.296598 hartree
zpe.thermalcorrener: 0.315919 hartree
zpe.thermalcorrenthalpy: 0.316863 hartree
zpe.thermalcorrgfe: 0.247224 hartree
zpe.sumelectzpe: -953.918349 hartree
zpe.sumelectthermal: -953.899029 hartree
zpe.sumelectthermalent: -953.898085 hartree
zpe.sumelectthermalfe: -953.967724 hartree
dipole: -6.7375 -2.3809 0.0206
dipole: 7.1459
quadrupole: -57.2651 -124.6251 -134.6398
quadrupole: -1.3206 -0.0707 0.0266
quadrupole: 48.2449 -19.1151 -29.1298 -1.3206 -0.0707 0.0266
hfenergy: -954.2149477 hartree
pointgroup: C01 [X(C18H16N2O2)]
dipole: 2.6285702 -0.4472214 -0.891402 debye
polarizability: 663.8869196|1.9263247|123.258245|-28.5864404|50.8627214|176.4972185 unknown
InChI: InChI=1S/C18H16N2O2/c1-20(2)15-10-8-13(9-11-15)12-16-18(21)22-17(19-16)14-6-4-3-5-7-14/h3-12H,1-2H3
charge 0 multiplicity 1
38 atoms
O  -2.25162 0.804049 1.40921
O  -0.04685 1.283462 2.075125
N  6.198024 0.210656 -0.035337
N  -1.883129 -0.38051 -0.543747
C  4.822129 0.073596 -0.177086
C  1.955173 -0.201998 -0.462926
C  4.25406 -0.629227 -1.293975
C  3.9142 0.63037 0.787621
C  2.869174 -0.755975 -1.420933
C  2.530156 0.498445 0.650425
C  0.545643 -0.39696 -0.702497
C  -0.607908 -0.017397 -0.018805
C  -2.793747 0.100474 0.288336
C  -4.246117 -0.002978 0.196781
C  7.107831 -0.366251 -1.037736
C  6.755471 0.939997 1.115697
C  -0.800387 0.746431 1.238461
C  -4.829389 -0.697864 -0.899678
C  -5.082428 0.580648 1.187831
C  -6.229607 -0.804999 -0.999334
C  -6.48392 0.468342 1.079385
C  -7.062326 -0.222962 -0.01137
H  4.900007 -1.071622 -2.057064
H  4.300645 1.17238 1.655085
H  2.463732 -1.297832 -2.28486
H  1.871095 0.93733 1.405364
H  0.307479 -0.963059 -1.615206
H  6.934275 0.06606 -2.043134
H  6.990728 -1.465604 -1.110037
H  8.149216 -0.153954 -0.751654
H  6.408801 1.991803 1.138596
H  7.854054 0.945374 1.047731
H  6.473831 0.463566 2.075182
H  -4.169371 -1.140582 -1.652579
H  -4.624541 1.112601 2.027368
H  -6.675547 -1.34049 -1.84468
H  -7.125652 0.919111 1.84429
H  -8.151781 -0.308032 -0.092145
